{"text_format":"1","workbook":"xlsx","n_sheets":4,"sheets":["S-P表","R7.11～　マクロ不動作対応マニュアル","Sheet2","Sheet3"],"not_rendered":{"charts":0,"images":7,"macros":1,"external_links":0,"defined_names":1,"comments":0,"pivot_tables":0},"unopened":[],"bounds":{"document_bytes":16777216,"sheet_cells":100000,"rows_first":2000,"rows_last":500,"rows_between":2000,"halvings":0,"cell_chars":16384,"cell_head_chars":4096},"cells_cut":0,"cells_raw":0,"read":"whole","date_system":"1900"}

{"sheet":"S-P表","index":0,"n_rows":2,"n_cols":3,"rows_kept":2,"cut":false,"hidden":false,"merged":[[0,3,0,4]]}
[]
[null,"No.","男女"]

{"sheet":"R7.11～　マクロ不動作対応マニュアル","index":1,"n_rows":70,"n_cols":1,"rows_kept":70,"cut":false,"hidden":false,"merged":[[5,0,5,8],[20,0,20,8],[44,0,44,8],[69,0,69,8]]}
["ＳＰ表作成にあたり、開いたファイルの左上の「ＳＰ表」ボタンが押せない、　　　　　　　　"]
["起動しない等の不動作が確認された場合、"]
["以下の①～④の手順で解消ください。"]
[]
[]
["①ファイルを（開く前に）右クリックして、「プロパティ」を開く。\n　下のセキュリティの「許可する」にチェックを入れＯＫを押す。"]
[]
[]
[]
[]
[]
[]
[]
[]
[]
[]
[]
[]
[]
[]
["②ファイルを開き、左上の「ファイル」を選択し、（「その他」⇒）\n「オプション」を選択する。"]
[]
[]
[]
[]
[]
[]
[]
[]
[]
[]
[]
[]
[]
[]
[]
[]
[]
[]
[]
[]
[]
[]
[]
["③「トラストセンター（または、セキュリティセンター）」を選択し、「トラストセンター（または、セキュリティーセンター）の設定」を選択する。"]
[]
[]
[]
[]
[]
[]
[]
[]
[]
[]
[]
[]
[]
[]
[]
[]
[]
[]
[]
[]
[]
[]
[]
[]
["④「ＡｃｔｉｖｅＸの設定」を選択し、\n「先に確認メッセージを表示してから～有効にする」を選択する。"]

{"sheet":"Sheet2","index":2,"n_rows":65,"n_cols":14,"rows_kept":65,"cut":false,"hidden":true,"merged":[]}
["問題数",40,"問題開始列",3,"最終列",{"$f":"IF(($B$1+$D$1)>26,CHAR(INT(($B$1+$D$1)/26.1)+64)&CHAR(IF(MOD(($B$1+$D$1),26)=0,90,MOD(($B$1+$D$1),26)+64)),CHAR($B$1+$D$1+64))","v":"AQ"},"生徒並び替え開始番地",{"$f":"IF(($D$1-1)>26,CHAR(INT(($D$1-1)/26.1)+64)&CHAR(IF(MOD(($D$1-1),26)=0,90,MOD(($D$1-1),26)+64)),CHAR(($D$1-1)+64))&TEXT($D$2+1,0)","v":"B3"},"生徒並び替え最終番地",{"$f":"IF(($B$1+$D$1+1)>26,CHAR(INT(($B$1+$D$1+1)/26.1)+64)&CHAR(IF(MOD(($B$1+$D$1+1),26)=0,90,MOD(($B$1+$D$1+1),26)+64)),CHAR($B$1+$D$1+1+64))&TEXT($F$2,0)","v":"AR62"},"生徒並び替えキー番地",{"$f":"IF(($B$1+$D$1+1)>26,CHAR(INT(($B$1+$D$1+1)/26.1)+64)&CHAR(IF(MOD(($B$1+$D$1+1),26)=0,90,MOD(($B$1+$D$1+1),26)+64)),CHAR($B$1+$D$1+1+64))&TEXT($D$2+1,0)","v":"AR3"},"生徒並び替え直しキー番地",{"$f":"IF(($D$1-1)>26,CHAR(INT(($D$1-1)/26.1)+64)&CHAR(IF(MOD(($D$1-1),26)=0,90,MOD(($D$1-1),26)+64)),CHAR($D$1-1+64))&TEXT($D$2+1,0)","v":"B3"}]
["生徒数",60,"生徒開始行",2,"最終行",{"$f":"$B$2+$D$2","v":62},"問題並び替え開始番地",{"$f":"IF(($D$1+1)>26,CHAR(INT(($D$1+1)/26.1)+64)&CHAR(IF(MOD(($D$1+1),26)=0,90,MOD(($D$1+1),26)+64)),CHAR($D$1+1+64))&TEXT($D$2,0)","v":"D2"},"問題並び替え最終番地",{"$f":"$F$1&TEXT($F$2+1,0)","v":"AQ63"},"問題並び替えキー番地",{"$f":"IF(($D$1+1)>26,CHAR(INT(($D$1+1)/26.1)+64)&CHAR(IF(MOD(($D$1+1),26)=0,90,MOD(($D$1+1),26)+64)),CHAR($D$1+1+64))&TEXT($F$2+1,0)","v":"D63"},"問題並び替え直しキー番地",{"$f":"$D$13&$B$17","v":"D2"}]
[null,{"$f":"COUNTA('S-P表'!C3:C502)","v":0}]
[]
["生徒数式入力列",{"$f":"IF(($B$1+$D$1+1)>26,CHAR(INT(($B$1+$D$1+1)/26.1)+64)&CHAR(IF(MOD(($B$1+$D$1+1),26)=0,90,MOD(($B$1+$D$1+1),26)+64)),CHAR($B$1+$D$1+1+64))","v":"AR"},null,null,null,null,1,{"$f":"IF(($D$1+$G$5)>26,CHAR(INT(($D$1+$G$5)/26.1)+64)&CHAR(IF(MOD(($D$1+$G$5),26)=0,90,MOD(($D$1+$G$5),26)+64)),CHAR($D$1+$G$5+64))","v":"D"}]
["生徒数式開始行",{"$f":"$D$1","v":3},1,null,null,null,{"$f":"$H$5&$B$12","v":"D63"},{"$f":"IF(($D$1+$G$5-1)>26,CHAR(INT(($D$1+$G$5-1)/26.1)+64)&CHAR(IF(MOD(($D$1+$G$5-1),26)=0,90,MOD(($D$1+$G$5-1),26)+64)),CHAR($D$1+$G$5-1+64))&TEXT($D$1-2,0)","v":"C1"}]
["生徒数式終了行",{"$f":"$F$2","v":62},{"$f":"$B$5&TEXT($B$6+$C$6-1,0)","v":"AR3"},null,{"$f":"$D$8-$D$11","v":-1806},null,1,{"$f":"$B$5&TEXT($B$6+$G$7-1,0)","v":"AR3"}]
["生徒合計開始列",{"$f":"IF(($D$1+1)>26,CHAR(INT(($D$1+1)/26.1)+64)&CHAR(IF(MOD(($D$1+1),26)=0,90,MOD(($D$1+1),26)+64)),CHAR($D$1+1+64))","v":"D"},{"$f":"\"Sheet3!\"&$B$8&TEXT($B$6+$C$6-1,0)&\":Sheet3!\"&$B$9&TEXT($B$6+$C$6-1,0)","v":"Sheet3!D3:Sheet3!AQ3"},10,{"$f":"IF(($D$8-$D$11)>1,$D$12&TEXT($B$6+$C$6-1,0)&\":\"&$D$9&TEXT($B$6+$C$6-1,0),IF(($D$8-$D$11)=1,$D$9&TEXT($B$6+$C$6-1,0),$D$9&TEXT($B$6+$C$6-1,0)))","v":"M3"},null,{"$f":"$B$5&$B$12","v":"AR63"}]
["生徒合計終了列",{"$f":"IF(($B$1+$D$1)>26,CHAR(INT(($B$1+$D$1)/26.1)+64)&CHAR(IF(MOD(($B$1+$D$1),26)=0,90,MOD(($B$1+$D$1),26)+64)),CHAR($B$1+$D$1+64))","v":"AQ"},null,{"$f":"IF(($D$8+$D$1)>26,CHAR(INT(($D$8+$D$1)/26.1)+64)&CHAR(IF(MOD(($D$8+$D$1),26)=0,90,MOD(($D$8+$D$1),26)+64)),CHAR($D$8+$D$1+64))","v":"M"},null,null,"生徒注意係数",{"$f":"$G$10&TEXT($B$17,0)","v":"AV2"},null,"問題注意係数",{"$f":"IF(($D$1+$J$10-1)>26,CHAR(INT(($D$1+$J$10-1)/26.1)+64)&CHAR(IF(MOD(($D$1+$J$10-1),26)=0,90,MOD(($D$1+$J$10-1),26)+64)),CHAR($D$1+$J$10-1+64))","v":"C"},{"$f":"$K$9&TEXT($D$2+$F$2+1,0)","v":"C65"}]
["予備開始列",{"$f":"IF(($B$1+$D$1+2)>26,CHAR(INT(($B$1+$D$1+2)/26.1)+64)&CHAR(IF(MOD(($B$1+$D$1+2),26)=0,90,MOD(($B$1+$D$1+2),26)+64)),CHAR($B$1+$D$1+2+64))","v":"AS"},null,null,null,null,{"$f":"IF(($B$1+$D$1+5)>26,CHAR(INT(($B$1+$D$1+5)/26.1)+64)&CHAR(IF(MOD(($B$1+$D$1+5),26)=0,90,MOD(($B$1+$D$1+5),26)+64)),CHAR($B$1+$D$1+5+64))","v":"AV"},{"$f":"$G$7","v":1},null,1,{"$f":"IF(($D$1+$J$10)>26,CHAR(INT(($D$1+$J$10)/26.1)+64)&CHAR(IF(MOD(($D$1+$J$10),26)=0,90,MOD(($D$1+$J$10),26)+64)),CHAR($D$1+$J$10+64))","v":"D"}]
["予備終了列",{"$f":"IF(($B$1+$D$1+4)>26,CHAR(INT(($B$1+$D$1+4)/26.1)+64)&CHAR(IF(MOD(($B$1+$D$1+4),26)=0,90,MOD(($B$1+$D$1+4),26)+64)),CHAR($B$1+$D$1+4+64))","v":"AU"},{"$f":"$B$5&TEXT($B$6+$C$6,0)","v":"AR4"},1816,null,null,{"$f":"$F$2","v":62},{"$f":"$G$10&TEXT($B$6+$H$10-1,0)","v":"AV3"},null,1,{"$f":"$K$10&TEXT($B$6+$J$11-1,0)","v":"D3"},{"$f":"$B$5&TEXT($B$6+$J$11-1,0)","v":"AR3"}]
["問題数式入力行",{"$f":"TEXT($B$2+$D$2+1,0)","v":"63"},null,{"$f":"IF(($D$11+$D$1+1)>26,CHAR(INT(($D$11+$D$1+1)/26.1)+64)&CHAR(IF(MOD(($D$11+$D$1+1),26)=0,90,MOD(($D$11+$D$1+1),26)+64)),CHAR($D$11+$D$1+1+64))","v":" Z"},null,null,null,null,null,null,{"$f":"$K$10&TEXT($B$12,0)","v":"D63"}]
["問題数式開始列",{"$f":"IF(($D$1+1)>26,CHAR(INT(($D$1+1)/26.1)+64)&CHAR(IF(MOD(($D$1+1),26)=0,90,MOD(($D$1+1),26)+64)),CHAR($D$1+1+64))","v":"D"},1,{"$f":"IF(($D$1+$C$13)>26,CHAR(INT(($D$1+$C$13)/26.1)+64)&CHAR(IF(MOD(($D$1+$C$13),26)=0,90,MOD(($D$1+$C$13),26)+64)),CHAR($D$1+$C$13+64))","v":"D"},null,null,1,{"$f":"IF(($D$1+$G$13)>26,CHAR(INT(($D$1+$G$13)/26.1)+64)&CHAR(IF(MOD(($D$1+$G$13),26)=0,90,MOD(($D$1+$G$13),26)+64)),CHAR($D$1+$G$13+64))","v":"D"},null,null,{"$f":"$K$10&TEXT($D$2+$F$2+1,0)","v":"D65"}]
["問題数式終了列",{"$f":"IF(($B$1+$D$1)>26,CHAR(INT(($B$1+$D$1)/26.1)+64)&CHAR(IF(MOD(($B$1+$D$1),26)=0,90,MOD(($B$1+$D$1),26)+64)),CHAR($B$1+$D$1+64))","v":"AQ"},{"$f":"$D$13&$B$12","v":"D63"},null,{"$f":"$D$15-$D$19","v":10},null,null,{"$f":"$H$13&TEXT($B$6+$H$10-1,0)","v":"D3"},"生徒逆並び替え最終番地",{"$f":"IF(($B$1+$D$1+5)>26,CHAR(INT(($B$1+$D$1+5)/26.1)+64)&CHAR(IF(MOD(($B$1+$D$1+5),26)=0,90,MOD(($B$1+$D$1+5),26)+64)),CHAR($B$1+$D$1+5+64))&TEXT($F$2,0)","v":"AV62"}]
["問題合計開始行",{"$f":"TEXT($D$1,0)","v":"3"},{"$f":"\"Sheet3!\"&$D$13&$B$15&\":Sheet3!\"&$D$13&$B$16","v":"Sheet3!D3:Sheet3!D62"},11,{"$f":"IF(($D$15-$D$19)>1,$D$13&$D$16&\":\"&$D$13&$D$20,IF(($D$15-$D$19)=1,$D$13&$D$16,$D$13&$D$16))","v":"D13:D4"},null,null,{"$f":"$H$13&$B$12","v":"D63"},"問題逆並び替え最終番地",{"$f":"$F$1&TEXT($F$2+3,0)","v":"AQ65"}]
["問題合計終了行",{"$f":"TEXT($F$2,0)","v":"62"},null,{"$f":"$D$15+$D$2","v":13}]
["問題番号入力行",{"$f":"TEXT($D$2,0)","v":"2"},{"$f":"$D$13&$B$17","v":"D2"}]
[null,null,{"$f":"IF(($D$1+$C$13+1)>26,CHAR(INT(($D$1+$C$13+1)/26.1)+64)&CHAR(IF(MOD(($D$1+$C$13+1),26)=0,90,MOD(($D$1+$C$13+1),26)+64)),CHAR($D$1+$C$13+1+64))","v":"E"}]
[null,null,{"$f":"$C$18&$B$12","v":"E63"},1,null,null,null,{"$f":"IF(($D$1+$I$19)>26,CHAR(INT(($D$1+$I$19)/26.1)+64)&CHAR(IF(MOD(($D$1+$I$19),26)=0,90,MOD(($D$1+$I$19),26)+64)),CHAR($D$1+$I$19+64))","v":"D"},1,null,{"$f":"IF(($D$1-1)>26,CHAR(INT(($D$1-1)/26.1)+64)&CHAR(IF(MOD(($D$1-1),26)=0,90,MOD(($D$1-1),26)+64)),CHAR($D$1-1+64))","v":"B"},{"$f":"$D$2","v":2}]
[null,null,null,{"$f":"$D$19+$D$2+1","v":4},null,null,null,{"$f":"$H$19&TEXT($H$21+$I$21-1,0)","v":"D3"},null,null,"Noタイトルセル",{"$f":"$K$19&TEXT($L$19,0)","v":"B2"}]
["生徒正答率",null,null,"問題正答率",null,null,null,{"$f":"$D$1","v":3},1,null,{"$f":"IF(($D$1)>26,CHAR(INT(($D$1)/26.1)+64)&CHAR(IF(MOD(($D$1),26)=0,90,MOD(($D$1),26)+64)),CHAR($D$1+64))","v":"C"},{"$f":"$D$2","v":2}]
["生徒数式入力列",{"$f":"IF(($B$1+$D$1+2)>26,CHAR(INT(($B$1+$D$1+2)/26.1)+64)&CHAR(IF(MOD(($B$1+$D$1+2),26)=0,90,MOD(($B$1+$D$1+2),26)+64)),CHAR($B$1+$D$1+2+64))","v":"AS"},{"$f":"IF(($B$1+$D$1+1)>26,CHAR(INT(($B$1+$D$1+1)/26.1)+64)&CHAR(IF(MOD(($B$1+$D$1+1),26)=0,90,MOD(($B$1+$D$1+1),26)+64)),CHAR($B$1+$D$1+1+64))","v":"AR"},"問題数式入力行",{"$f":"TEXT($B$2+$D$2+1,0)","v":"63"},null,null,null,null,null,"男女タイトル列",{"$f":"$K$21&TEXT($L$21,0)","v":"C2"}]
["生徒数式開始行",{"$f":"$D$1","v":3},1,"問題数式開始列",{"$f":"IF(($D$1+1)>26,CHAR(INT(($D$1+1)/26.1)+64)&CHAR(IF(MOD(($D$1+1),26)=0,90,MOD(($D$1+1),26)+64)),CHAR($D$1+1+64))","v":"D"},1,{"$f":"IF(($D$1+$F$23)>26,CHAR(INT(($D$1+$F$23)/26.1)+64)&CHAR(IF(MOD(($D$1+$F$23),26)=0,90,MOD(($D$1+$F$23),26)+64)),CHAR($D$1+$F$23+64))","v":"D"},null,{"$f":"IF(($D$1)>26,CHAR(INT(($D$1)/26.1)+64)&CHAR(IF(MOD(($D$1),26)=0,90,MOD(($D$1),26)+64)),CHAR($D$1+64))","v":"C"}]
["生徒数式終了行",{"$f":"$F$2","v":62},{"$f":"$C$22&TEXT($B$6+$C$23-1,0)","v":"AR3"},"問題数式終了列",{"$f":"IF(($B$1+$D$1)>26,CHAR(INT(($B$1+$D$1)/26.1)+64)&CHAR(IF(MOD(($B$1+$D$1),26)=0,90,MOD(($B$1+$D$1),26)+64)),CHAR($B$1+$D$1+64))","v":"AQ"},{"$f":"$G$23&$B$12","v":"D63"},null,null,{"$f":"$I$23&TEXT($D$2+$F$2,0)","v":"C64"}]
[null,null,{"$f":"$B$22&TEXT($B$6+$C$23-1,0)","v":"AS3"},"問題合計開始行",null,{"$f":"$G$23&TEXT($D$2+$F$2,0)","v":"D64"}]
["\"=3\""]
["生徒数式入力列",{"$f":"IF(($B$1+$D$1+3)>26,CHAR(INT(($B$1+$D$1+3)/26.1)+64)&CHAR(IF(MOD(($B$1+$D$1+3),26)=0,90,MOD(($B$1+$D$1+3),26)+64)),CHAR($B$1+$D$1+3+64))","v":"AT"}]
["生徒数式開始行",{"$f":"$D$1","v":3},1]
["生徒数式終了行",{"$f":"$F$2","v":62},{"$f":"$B$27&TEXT($B$6+$C$28-1,0)","v":"AT3"}]
[null,null,{"$f":"$B$8&TEXT($B$6+$C$28-1,0)&\":\"&$B$9&TEXT($B$6+$C$28-1,0)","v":"D3:AQ3"}]
[]
[]
[]
[]
[]
[]
[49,{"$f":"TEXT(IF(AND(A37>=18,A37<=45),A37+20,IF(AND(A37>=46,A37<=73),A37-8,IF(AND(A37>=74,A37<=100),A37-36,\"\"))),0)","v":"41"}]
[0.317,0.38300000000000001,0.40799999999999997]
[0.32100000000000001,0.38400000000000001,0.40899999999999997]
[0.32600000000000001,0.38500000000000001,0.40899999999999997]
[0.33,0.38600000000000001,0.41]
[0.33400000000000002,0.38700000000000001,0.41]
[0.33700000000000002,0.38800000000000001,0.41099999999999998]
[0.34100000000000003,0.38900000000000001,0.41099999999999998]
[0.34399999999999997,0.39,0.41199999999999998]
[0.34699999999999998,0.39100000000000001,0.41199999999999998]
[0.35,0.39200000000000002,0.41299999999999998]
[0.35299999999999998,0.39300000000000002,0.41299999999999998]
[0.35499999999999998,0.39400000000000002,0.41399999999999998]
[0.35799999999999998,0.39500000000000002,0.41399999999999998]
[0.36,0.39600000000000002,0.41499999999999998]
[0.36199999999999999,0.39700000000000002,0.41499999999999998]
[0.36399999999999999,0.39800000000000002,0.41599999999999998]
[0.36599999999999999,0.39900000000000002,0.41599999999999998]
[0.36699999999999999,0.4,0.41699999999999998]
[0.36899999999999999,0.40100000000000002,0.41699999999999998]
[0.37,0.40200000000000002,0.41799999999999998]
[0.372,0.40300000000000002,0.41799999999999998]
[0.373,0.40400000000000003,0.41899999999999998]
[0.375,0.40400000000000003,0.41899999999999998]
[0.377,0.40500000000000003,0.41899999999999998]
[0.378,0.40500000000000003,0.42]
[0.38,0.40600000000000003,0.42]
[0.38100000000000001,0.40699999999999997,0.42]
[0.38200000000000001,0.40799999999999997]

{"sheet":"Sheet3","index":3,"n_rows":63,"n_cols":44,"rows_kept":63,"cut":false,"hidden":true,"merged":[]}
[]
[]
[null,null,null,{"$f":"IF('S-P表'!D3=1,1,IF('S-P表'!D3=3,\"b\",0))","v":0},{"$f":"IF('S-P表'!E3=1,1,IF('S-P表'!E3=3,\"b\",0))","v":0},{"$f":"IF('S-P表'!F3=1,1,IF('S-P表'!F3=3,\"b\",0))","v":0},{"$f":"IF('S-P表'!G3=1,1,IF('S-P表'!G3=3,\"b\",0))","v":0},{"$f":"IF('S-P表'!H3=1,1,IF('S-P表'!H3=3,\"b\",0))","v":0},{"$f":"IF('S-P表'!I3=1,1,IF('S-P表'!I3=3,\"b\",0))","v":0},{"$f":"IF('S-P表'!J3=1,1,IF('S-P表'!J3=3,\"b\",0))","v":0},{"$f":"IF('S-P表'!K3=1,1,IF('S-P表'!K3=3,\"b\",0))","v":0},{"$f":"IF('S-P表'!L3=1,1,IF('S-P表'!L3=3,\"b\",0))","v":0},{"$f":"IF('S-P表'!M3=1,1,IF('S-P表'!M3=3,\"b\",0))","v":0},{"$f":"IF('S-P表'!N3=1,1,IF('S-P表'!N3=3,\"b\",0))","v":0},{"$f":"IF('S-P表'!O3=1,1,IF('S-P表'!O3=3,\"b\",0))","v":0},{"$f":"IF('S-P表'!P3=1,1,IF('S-P表'!P3=3,\"b\",0))","v":0},{"$f":"IF('S-P表'!Q3=1,1,IF('S-P表'!Q3=3,\"b\",0))","v":0},{"$f":"IF('S-P表'!R3=1,1,IF('S-P表'!R3=3,\"b\",0))","v":0},{"$f":"IF('S-P表'!S3=1,1,IF('S-P表'!S3=3,\"b\",0))","v":0},{"$f":"IF('S-P表'!T3=1,1,IF('S-P表'!T3=3,\"b\",0))","v":0},{"$f":"IF('S-P表'!U3=1,1,IF('S-P表'!U3=3,\"b\",0))","v":0},{"$f":"IF('S-P表'!V3=1,1,IF('S-P表'!V3=3,\"b\",0))","v":0},{"$f":"IF('S-P表'!W3=1,1,IF('S-P表'!W3=3,\"b\",0))","v":0},{"$f":"IF('S-P表'!X3=1,1,IF('S-P表'!X3=3,\"b\",0))","v":0},{"$f":"IF('S-P表'!Y3=1,1,IF('S-P表'!Y3=3,\"b\",0))","v":0},{"$f":"IF('S-P表'!Z3=1,1,IF('S-P表'!Z3=3,\"b\",0))","v":0},{"$f":"IF('S-P表'!AA3=1,1,IF('S-P表'!AA3=3,\"b\",0))","v":0},{"$f":"IF('S-P表'!AB3=1,1,IF('S-P表'!AB3=3,\"b\",0))","v":0},{"$f":"IF('S-P表'!AC3=1,1,IF('S-P表'!AC3=3,\"b\",0))","v":0},{"$f":"IF('S-P表'!AD3=1,1,IF('S-P表'!AD3=3,\"b\",0))","v":0},{"$f":"IF('S-P表'!AE3=1,1,IF('S-P表'!AE3=3,\"b\",0))","v":0},{"$f":"IF('S-P表'!AF3=1,1,IF('S-P表'!AF3=3,\"b\",0))","v":0},{"$f":"IF('S-P表'!AG3=1,1,IF('S-P表'!AG3=3,\"b\",0))","v":0},{"$f":"IF('S-P表'!AH3=1,1,IF('S-P表'!AH3=3,\"b\",0))","v":0},{"$f":"IF('S-P表'!AI3=1,1,IF('S-P表'!AI3=3,\"b\",0))","v":0},{"$f":"IF('S-P表'!AJ3=1,1,IF('S-P表'!AJ3=3,\"b\",0))","v":0},{"$f":"IF('S-P表'!AK3=1,1,IF('S-P表'!AK3=3,\"b\",0))","v":0},{"$f":"IF('S-P表'!AL3=1,1,IF('S-P表'!AL3=3,\"b\",0))","v":0},{"$f":"IF('S-P表'!AM3=1,1,IF('S-P表'!AM3=3,\"b\",0))","v":0},{"$f":"IF('S-P表'!AN3=1,1,IF('S-P表'!AN3=3,\"b\",0))","v":0},{"$f":"IF('S-P表'!AO3=1,1,IF('S-P表'!AO3=3,\"b\",0))","v":0},{"$f":"IF('S-P表'!AP3=1,1,IF('S-P表'!AP3=3,\"b\",0))","v":0},{"$f":"IF('S-P表'!AQ3=1,1,IF('S-P表'!AQ3=3,\"b\",0))","v":0},{"$f":"SUM(Sheet3!D3:'Sheet3'!AQ3)","v":0}]
[null,null,null,{"$f":"IF('S-P表'!D4=1,1,IF('S-P表'!D4=3,\"b\",0))","v":0},{"$f":"IF('S-P表'!E4=1,1,IF('S-P表'!E4=3,\"b\",0))","v":0},{"$f":"IF('S-P表'!F4=1,1,IF('S-P表'!F4=3,\"b\",0))","v":0},{"$f":"IF('S-P表'!G4=1,1,IF('S-P表'!G4=3,\"b\",0))","v":0},{"$f":"IF('S-P表'!H4=1,1,IF('S-P表'!H4=3,\"b\",0))","v":0},{"$f":"IF('S-P表'!I4=1,1,IF('S-P表'!I4=3,\"b\",0))","v":0},{"$f":"IF('S-P表'!J4=1,1,IF('S-P表'!J4=3,\"b\",0))","v":0},{"$f":"IF('S-P表'!K4=1,1,IF('S-P表'!K4=3,\"b\",0))","v":0},{"$f":"IF('S-P表'!L4=1,1,IF('S-P表'!L4=3,\"b\",0))","v":0},{"$f":"IF('S-P表'!M4=1,1,IF('S-P表'!M4=3,\"b\",0))","v":0},{"$f":"IF('S-P表'!N4=1,1,IF('S-P表'!N4=3,\"b\",0))","v":0},{"$f":"IF('S-P表'!O4=1,1,IF('S-P表'!O4=3,\"b\",0))","v":0},{"$f":"IF('S-P表'!P4=1,1,IF('S-P表'!P4=3,\"b\",0))","v":0},{"$f":"IF('S-P表'!Q4=1,1,IF('S-P表'!Q4=3,\"b\",0))","v":0},{"$f":"IF('S-P表'!R4=1,1,IF('S-P表'!R4=3,\"b\",0))","v":0},{"$f":"IF('S-P表'!S4=1,1,IF('S-P表'!S4=3,\"b\",0))","v":0},{"$f":"IF('S-P表'!T4=1,1,IF('S-P表'!T4=3,\"b\",0))","v":0},{"$f":"IF('S-P表'!U4=1,1,IF('S-P表'!U4=3,\"b\",0))","v":0},{"$f":"IF('S-P表'!V4=1,1,IF('S-P表'!V4=3,\"b\",0))","v":0},{"$f":"IF('S-P表'!W4=1,1,IF('S-P表'!W4=3,\"b\",0))","v":0},{"$f":"IF('S-P表'!X4=1,1,IF('S-P表'!X4=3,\"b\",0))","v":0},{"$f":"IF('S-P表'!Y4=1,1,IF('S-P表'!Y4=3,\"b\",0))","v":0},{"$f":"IF('S-P表'!Z4=1,1,IF('S-P表'!Z4=3,\"b\",0))","v":0},{"$f":"IF('S-P表'!AA4=1,1,IF('S-P表'!AA4=3,\"b\",0))","v":0},{"$f":"IF('S-P表'!AB4=1,1,IF('S-P表'!AB4=3,\"b\",0))","v":0},{"$f":"IF('S-P表'!AC4=1,1,IF('S-P表'!AC4=3,\"b\",0))","v":0},{"$f":"IF('S-P表'!AD4=1,1,IF('S-P表'!AD4=3,\"b\",0))","v":0},{"$f":"IF('S-P表'!AE4=1,1,IF('S-P表'!AE4=3,\"b\",0))","v":0},{"$f":"IF('S-P表'!AF4=1,1,IF('S-P表'!AF4=3,\"b\",0))","v":0},{"$f":"IF('S-P表'!AG4=1,1,IF('S-P表'!AG4=3,\"b\",0))","v":0},{"$f":"IF('S-P表'!AH4=1,1,IF('S-P表'!AH4=3,\"b\",0))","v":0},{"$f":"IF('S-P表'!AI4=1,1,IF('S-P表'!AI4=3,\"b\",0))","v":0},{"$f":"IF('S-P表'!AJ4=1,1,IF('S-P表'!AJ4=3,\"b\",0))","v":0},{"$f":"IF('S-P表'!AK4=1,1,IF('S-P表'!AK4=3,\"b\",0))","v":0},{"$f":"IF('S-P表'!AL4=1,1,IF('S-P表'!AL4=3,\"b\",0))","v":0},{"$f":"IF('S-P表'!AM4=1,1,IF('S-P表'!AM4=3,\"b\",0))","v":0},{"$f":"IF('S-P表'!AN4=1,1,IF('S-P表'!AN4=3,\"b\",0))","v":0},{"$f":"IF('S-P表'!AO4=1,1,IF('S-P表'!AO4=3,\"b\",0))","v":0},{"$f":"IF('S-P表'!AP4=1,1,IF('S-P表'!AP4=3,\"b\",0))","v":0},{"$f":"IF('S-P表'!AQ4=1,1,IF('S-P表'!AQ4=3,\"b\",0))","v":0},{"$f":"SUM(Sheet3!D4:'Sheet3'!AQ4)","v":0}]
[null,null,null,{"$f":"IF('S-P表'!D5=1,1,IF('S-P表'!D5=3,\"b\",0))","v":0},{"$f":"IF('S-P表'!E5=1,1,IF('S-P表'!E5=3,\"b\",0))","v":0},{"$f":"IF('S-P表'!F5=1,1,IF('S-P表'!F5=3,\"b\",0))","v":0},{"$f":"IF('S-P表'!G5=1,1,IF('S-P表'!G5=3,\"b\",0))","v":0},{"$f":"IF('S-P表'!H5=1,1,IF('S-P表'!H5=3,\"b\",0))","v":0},{"$f":"IF('S-P表'!I5=1,1,IF('S-P表'!I5=3,\"b\",0))","v":0},{"$f":"IF('S-P表'!J5=1,1,IF('S-P表'!J5=3,\"b\",0))","v":0},{"$f":"IF('S-P表'!K5=1,1,IF('S-P表'!K5=3,\"b\",0))","v":0},{"$f":"IF('S-P表'!L5=1,1,IF('S-P表'!L5=3,\"b\",0))","v":0},{"$f":"IF('S-P表'!M5=1,1,IF('S-P表'!M5=3,\"b\",0))","v":0},{"$f":"IF('S-P表'!N5=1,1,IF('S-P表'!N5=3,\"b\",0))","v":0},{"$f":"IF('S-P表'!O5=1,1,IF('S-P表'!O5=3,\"b\",0))","v":0},{"$f":"IF('S-P表'!P5=1,1,IF('S-P表'!P5=3,\"b\",0))","v":0},{"$f":"IF('S-P表'!Q5=1,1,IF('S-P表'!Q5=3,\"b\",0))","v":0},{"$f":"IF('S-P表'!R5=1,1,IF('S-P表'!R5=3,\"b\",0))","v":0},{"$f":"IF('S-P表'!S5=1,1,IF('S-P表'!S5=3,\"b\",0))","v":0},{"$f":"IF('S-P表'!T5=1,1,IF('S-P表'!T5=3,\"b\",0))","v":0},{"$f":"IF('S-P表'!U5=1,1,IF('S-P表'!U5=3,\"b\",0))","v":0},{"$f":"IF('S-P表'!V5=1,1,IF('S-P表'!V5=3,\"b\",0))","v":0},{"$f":"IF('S-P表'!W5=1,1,IF('S-P表'!W5=3,\"b\",0))","v":0},{"$f":"IF('S-P表'!X5=1,1,IF('S-P表'!X5=3,\"b\",0))","v":0},{"$f":"IF('S-P表'!Y5=1,1,IF('S-P表'!Y5=3,\"b\",0))","v":0},{"$f":"IF('S-P表'!Z5=1,1,IF('S-P表'!Z5=3,\"b\",0))","v":0},{"$f":"IF('S-P表'!AA5=1,1,IF('S-P表'!AA5=3,\"b\",0))","v":0},{"$f":"IF('S-P表'!AB5=1,1,IF('S-P表'!AB5=3,\"b\",0))","v":0},{"$f":"IF('S-P表'!AC5=1,1,IF('S-P表'!AC5=3,\"b\",0))","v":0},{"$f":"IF('S-P表'!AD5=1,1,IF('S-P表'!AD5=3,\"b\",0))","v":0},{"$f":"IF('S-P表'!AE5=1,1,IF('S-P表'!AE5=3,\"b\",0))","v":0},{"$f":"IF('S-P表'!AF5=1,1,IF('S-P表'!AF5=3,\"b\",0))","v":0},{"$f":"IF('S-P表'!AG5=1,1,IF('S-P表'!AG5=3,\"b\",0))","v":0},{"$f":"IF('S-P表'!AH5=1,1,IF('S-P表'!AH5=3,\"b\",0))","v":0},{"$f":"IF('S-P表'!AI5=1,1,IF('S-P表'!AI5=3,\"b\",0))","v":0},{"$f":"IF('S-P表'!AJ5=1,1,IF('S-P表'!AJ5=3,\"b\",0))","v":0},{"$f":"IF('S-P表'!AK5=1,1,IF('S-P表'!AK5=3,\"b\",0))","v":0},{"$f":"IF('S-P表'!AL5=1,1,IF('S-P表'!AL5=3,\"b\",0))","v":0},{"$f":"IF('S-P表'!AM5=1,1,IF('S-P表'!AM5=3,\"b\",0))","v":0},{"$f":"IF('S-P表'!AN5=1,1,IF('S-P表'!AN5=3,\"b\",0))","v":0},{"$f":"IF('S-P表'!AO5=1,1,IF('S-P表'!AO5=3,\"b\",0))","v":0},{"$f":"IF('S-P表'!AP5=1,1,IF('S-P表'!AP5=3,\"b\",0))","v":0},{"$f":"IF('S-P表'!AQ5=1,1,IF('S-P表'!AQ5=3,\"b\",0))","v":0},{"$f":"SUM(Sheet3!D5:'Sheet3'!AQ5)","v":0}]
[null,null,null,{"$f":"IF('S-P表'!D6=1,1,IF('S-P表'!D6=3,\"b\",0))","v":0},{"$f":"IF('S-P表'!E6=1,1,IF('S-P表'!E6=3,\"b\",0))","v":0},{"$f":"IF('S-P表'!F6=1,1,IF('S-P表'!F6=3,\"b\",0))","v":0},{"$f":"IF('S-P表'!G6=1,1,IF('S-P表'!G6=3,\"b\",0))","v":0},{"$f":"IF('S-P表'!H6=1,1,IF('S-P表'!H6=3,\"b\",0))","v":0},{"$f":"IF('S-P表'!I6=1,1,IF('S-P表'!I6=3,\"b\",0))","v":0},{"$f":"IF('S-P表'!J6=1,1,IF('S-P表'!J6=3,\"b\",0))","v":0},{"$f":"IF('S-P表'!K6=1,1,IF('S-P表'!K6=3,\"b\",0))","v":0},{"$f":"IF('S-P表'!L6=1,1,IF('S-P表'!L6=3,\"b\",0))","v":0},{"$f":"IF('S-P表'!M6=1,1,IF('S-P表'!M6=3,\"b\",0))","v":0},{"$f":"IF('S-P表'!N6=1,1,IF('S-P表'!N6=3,\"b\",0))","v":0},{"$f":"IF('S-P表'!O6=1,1,IF('S-P表'!O6=3,\"b\",0))","v":0},{"$f":"IF('S-P表'!P6=1,1,IF('S-P表'!P6=3,\"b\",0))","v":0},{"$f":"IF('S-P表'!Q6=1,1,IF('S-P表'!Q6=3,\"b\",0))","v":0},{"$f":"IF('S-P表'!R6=1,1,IF('S-P表'!R6=3,\"b\",0))","v":0},{"$f":"IF('S-P表'!S6=1,1,IF('S-P表'!S6=3,\"b\",0))","v":0},{"$f":"IF('S-P表'!T6=1,1,IF('S-P表'!T6=3,\"b\",0))","v":0},{"$f":"IF('S-P表'!U6=1,1,IF('S-P表'!U6=3,\"b\",0))","v":0},{"$f":"IF('S-P表'!V6=1,1,IF('S-P表'!V6=3,\"b\",0))","v":0},{"$f":"IF('S-P表'!W6=1,1,IF('S-P表'!W6=3,\"b\",0))","v":0},{"$f":"IF('S-P表'!X6=1,1,IF('S-P表'!X6=3,\"b\",0))","v":0},{"$f":"IF('S-P表'!Y6=1,1,IF('S-P表'!Y6=3,\"b\",0))","v":0},{"$f":"IF('S-P表'!Z6=1,1,IF('S-P表'!Z6=3,\"b\",0))","v":0},{"$f":"IF('S-P表'!AA6=1,1,IF('S-P表'!AA6=3,\"b\",0))","v":0},{"$f":"IF('S-P表'!AB6=1,1,IF('S-P表'!AB6=3,\"b\",0))","v":0},{"$f":"IF('S-P表'!AC6=1,1,IF('S-P表'!AC6=3,\"b\",0))","v":0},{"$f":"IF('S-P表'!AD6=1,1,IF('S-P表'!AD6=3,\"b\",0))","v":0},{"$f":"IF('S-P表'!AE6=1,1,IF('S-P表'!AE6=3,\"b\",0))","v":0},{"$f":"IF('S-P表'!AF6=1,1,IF('S-P表'!AF6=3,\"b\",0))","v":0},{"$f":"IF('S-P表'!AG6=1,1,IF('S-P表'!AG6=3,\"b\",0))","v":0},{"$f":"IF('S-P表'!AH6=1,1,IF('S-P表'!AH6=3,\"b\",0))","v":0},{"$f":"IF('S-P表'!AI6=1,1,IF('S-P表'!AI6=3,\"b\",0))","v":0},{"$f":"IF('S-P表'!AJ6=1,1,IF('S-P表'!AJ6=3,\"b\",0))","v":0},{"$f":"IF('S-P表'!AK6=1,1,IF('S-P表'!AK6=3,\"b\",0))","v":0},{"$f":"IF('S-P表'!AL6=1,1,IF('S-P表'!AL6=3,\"b\",0))","v":0},{"$f":"IF('S-P表'!AM6=1,1,IF('S-P表'!AM6=3,\"b\",0))","v":0},{"$f":"IF('S-P表'!AN6=1,1,IF('S-P表'!AN6=3,\"b\",0))","v":0},{"$f":"IF('S-P表'!AO6=1,1,IF('S-P表'!AO6=3,\"b\",0))","v":0},{"$f":"IF('S-P表'!AP6=1,1,IF('S-P表'!AP6=3,\"b\",0))","v":0},{"$f":"IF('S-P表'!AQ6=1,1,IF('S-P表'!AQ6=3,\"b\",0))","v":0},{"$f":"SUM(Sheet3!D6:'Sheet3'!AQ6)","v":0}]
[null,null,null,{"$f":"IF('S-P表'!D7=1,1,IF('S-P表'!D7=3,\"b\",0))","v":0},{"$f":"IF('S-P表'!E7=1,1,IF('S-P表'!E7=3,\"b\",0))","v":0},{"$f":"IF('S-P表'!F7=1,1,IF('S-P表'!F7=3,\"b\",0))","v":0},{"$f":"IF('S-P表'!G7=1,1,IF('S-P表'!G7=3,\"b\",0))","v":0},{"$f":"IF('S-P表'!H7=1,1,IF('S-P表'!H7=3,\"b\",0))","v":0},{"$f":"IF('S-P表'!I7=1,1,IF('S-P表'!I7=3,\"b\",0))","v":0},{"$f":"IF('S-P表'!J7=1,1,IF('S-P表'!J7=3,\"b\",0))","v":0},{"$f":"IF('S-P表'!K7=1,1,IF('S-P表'!K7=3,\"b\",0))","v":0},{"$f":"IF('S-P表'!L7=1,1,IF('S-P表'!L7=3,\"b\",0))","v":0},{"$f":"IF('S-P表'!M7=1,1,IF('S-P表'!M7=3,\"b\",0))","v":0},{"$f":"IF('S-P表'!N7=1,1,IF('S-P表'!N7=3,\"b\",0))","v":0},{"$f":"IF('S-P表'!O7=1,1,IF('S-P表'!O7=3,\"b\",0))","v":0},{"$f":"IF('S-P表'!P7=1,1,IF('S-P表'!P7=3,\"b\",0))","v":0},{"$f":"IF('S-P表'!Q7=1,1,IF('S-P表'!Q7=3,\"b\",0))","v":0},{"$f":"IF('S-P表'!R7=1,1,IF('S-P表'!R7=3,\"b\",0))","v":0},{"$f":"IF('S-P表'!S7=1,1,IF('S-P表'!S7=3,\"b\",0))","v":0},{"$f":"IF('S-P表'!T7=1,1,IF('S-P表'!T7=3,\"b\",0))","v":0},{"$f":"IF('S-P表'!U7=1,1,IF('S-P表'!U7=3,\"b\",0))","v":0},{"$f":"IF('S-P表'!V7=1,1,IF('S-P表'!V7=3,\"b\",0))","v":0},{"$f":"IF('S-P表'!W7=1,1,IF('S-P表'!W7=3,\"b\",0))","v":0},{"$f":"IF('S-P表'!X7=1,1,IF('S-P表'!X7=3,\"b\",0))","v":0},{"$f":"IF('S-P表'!Y7=1,1,IF('S-P表'!Y7=3,\"b\",0))","v":0},{"$f":"IF('S-P表'!Z7=1,1,IF('S-P表'!Z7=3,\"b\",0))","v":0},{"$f":"IF('S-P表'!AA7=1,1,IF('S-P表'!AA7=3,\"b\",0))","v":0},{"$f":"IF('S-P表'!AB7=1,1,IF('S-P表'!AB7=3,\"b\",0))","v":0},{"$f":"IF('S-P表'!AC7=1,1,IF('S-P表'!AC7=3,\"b\",0))","v":0},{"$f":"IF('S-P表'!AD7=1,1,IF('S-P表'!AD7=3,\"b\",0))","v":0},{"$f":"IF('S-P表'!AE7=1,1,IF('S-P表'!AE7=3,\"b\",0))","v":0},{"$f":"IF('S-P表'!AF7=1,1,IF('S-P表'!AF7=3,\"b\",0))","v":0},{"$f":"IF('S-P表'!AG7=1,1,IF('S-P表'!AG7=3,\"b\",0))","v":0},{"$f":"IF('S-P表'!AH7=1,1,IF('S-P表'!AH7=3,\"b\",0))","v":0},{"$f":"IF('S-P表'!AI7=1,1,IF('S-P表'!AI7=3,\"b\",0))","v":0},{"$f":"IF('S-P表'!AJ7=1,1,IF('S-P表'!AJ7=3,\"b\",0))","v":0},{"$f":"IF('S-P表'!AK7=1,1,IF('S-P表'!AK7=3,\"b\",0))","v":0},{"$f":"IF('S-P表'!AL7=1,1,IF('S-P表'!AL7=3,\"b\",0))","v":0},{"$f":"IF('S-P表'!AM7=1,1,IF('S-P表'!AM7=3,\"b\",0))","v":0},{"$f":"IF('S-P表'!AN7=1,1,IF('S-P表'!AN7=3,\"b\",0))","v":0},{"$f":"IF('S-P表'!AO7=1,1,IF('S-P表'!AO7=3,\"b\",0))","v":0},{"$f":"IF('S-P表'!AP7=1,1,IF('S-P表'!AP7=3,\"b\",0))","v":0},{"$f":"IF('S-P表'!AQ7=1,1,IF('S-P表'!AQ7=3,\"b\",0))","v":0},{"$f":"SUM(Sheet3!D7:'Sheet3'!AQ7)","v":0}]
[null,null,null,{"$f":"IF('S-P表'!D8=1,1,IF('S-P表'!D8=3,\"b\",0))","v":0},{"$f":"IF('S-P表'!E8=1,1,IF('S-P表'!E8=3,\"b\",0))","v":0},{"$f":"IF('S-P表'!F8=1,1,IF('S-P表'!F8=3,\"b\",0))","v":0},{"$f":"IF('S-P表'!G8=1,1,IF('S-P表'!G8=3,\"b\",0))","v":0},{"$f":"IF('S-P表'!H8=1,1,IF('S-P表'!H8=3,\"b\",0))","v":0},{"$f":"IF('S-P表'!I8=1,1,IF('S-P表'!I8=3,\"b\",0))","v":0},{"$f":"IF('S-P表'!J8=1,1,IF('S-P表'!J8=3,\"b\",0))","v":0},{"$f":"IF('S-P表'!K8=1,1,IF('S-P表'!K8=3,\"b\",0))","v":0},{"$f":"IF('S-P表'!L8=1,1,IF('S-P表'!L8=3,\"b\",0))","v":0},{"$f":"IF('S-P表'!M8=1,1,IF('S-P表'!M8=3,\"b\",0))","v":0},{"$f":"IF('S-P表'!N8=1,1,IF('S-P表'!N8=3,\"b\",0))","v":0},{"$f":"IF('S-P表'!O8=1,1,IF('S-P表'!O8=3,\"b\",0))","v":0},{"$f":"IF('S-P表'!P8=1,1,IF('S-P表'!P8=3,\"b\",0))","v":0},{"$f":"IF('S-P表'!Q8=1,1,IF('S-P表'!Q8=3,\"b\",0))","v":0},{"$f":"IF('S-P表'!R8=1,1,IF('S-P表'!R8=3,\"b\",0))","v":0},{"$f":"IF('S-P表'!S8=1,1,IF('S-P表'!S8=3,\"b\",0))","v":0},{"$f":"IF('S-P表'!T8=1,1,IF('S-P表'!T8=3,\"b\",0))","v":0},{"$f":"IF('S-P表'!U8=1,1,IF('S-P表'!U8=3,\"b\",0))","v":0},{"$f":"IF('S-P表'!V8=1,1,IF('S-P表'!V8=3,\"b\",0))","v":0},{"$f":"IF('S-P表'!W8=1,1,IF('S-P表'!W8=3,\"b\",0))","v":0},{"$f":"IF('S-P表'!X8=1,1,IF('S-P表'!X8=3,\"b\",0))","v":0},{"$f":"IF('S-P表'!Y8=1,1,IF('S-P表'!Y8=3,\"b\",0))","v":0},{"$f":"IF('S-P表'!Z8=1,1,IF('S-P表'!Z8=3,\"b\",0))","v":0},{"$f":"IF('S-P表'!AA8=1,1,IF('S-P表'!AA8=3,\"b\",0))","v":0},{"$f":"IF('S-P表'!AB8=1,1,IF('S-P表'!AB8=3,\"b\",0))","v":0},{"$f":"IF('S-P表'!AC8=1,1,IF('S-P表'!AC8=3,\"b\",0))","v":0},{"$f":"IF('S-P表'!AD8=1,1,IF('S-P表'!AD8=3,\"b\",0))","v":0},{"$f":"IF('S-P表'!AE8=1,1,IF('S-P表'!AE8=3,\"b\",0))","v":0},{"$f":"IF('S-P表'!AF8=1,1,IF('S-P表'!AF8=3,\"b\",0))","v":0},{"$f":"IF('S-P表'!AG8=1,1,IF('S-P表'!AG8=3,\"b\",0))","v":0},{"$f":"IF('S-P表'!AH8=1,1,IF('S-P表'!AH8=3,\"b\",0))","v":0},{"$f":"IF('S-P表'!AI8=1,1,IF('S-P表'!AI8=3,\"b\",0))","v":0},{"$f":"IF('S-P表'!AJ8=1,1,IF('S-P表'!AJ8=3,\"b\",0))","v":0},{"$f":"IF('S-P表'!AK8=1,1,IF('S-P表'!AK8=3,\"b\",0))","v":0},{"$f":"IF('S-P表'!AL8=1,1,IF('S-P表'!AL8=3,\"b\",0))","v":0},{"$f":"IF('S-P表'!AM8=1,1,IF('S-P表'!AM8=3,\"b\",0))","v":0},{"$f":"IF('S-P表'!AN8=1,1,IF('S-P表'!AN8=3,\"b\",0))","v":0},{"$f":"IF('S-P表'!AO8=1,1,IF('S-P表'!AO8=3,\"b\",0))","v":0},{"$f":"IF('S-P表'!AP8=1,1,IF('S-P表'!AP8=3,\"b\",0))","v":0},{"$f":"IF('S-P表'!AQ8=1,1,IF('S-P表'!AQ8=3,\"b\",0))","v":0},{"$f":"SUM(Sheet3!D8:'Sheet3'!AQ8)","v":0}]
[null,null,null,{"$f":"IF('S-P表'!D9=1,1,IF('S-P表'!D9=3,\"b\",0))","v":0},{"$f":"IF('S-P表'!E9=1,1,IF('S-P表'!E9=3,\"b\",0))","v":0},{"$f":"IF('S-P表'!F9=1,1,IF('S-P表'!F9=3,\"b\",0))","v":0},{"$f":"IF('S-P表'!G9=1,1,IF('S-P表'!G9=3,\"b\",0))","v":0},{"$f":"IF('S-P表'!H9=1,1,IF('S-P表'!H9=3,\"b\",0))","v":0},{"$f":"IF('S-P表'!I9=1,1,IF('S-P表'!I9=3,\"b\",0))","v":0},{"$f":"IF('S-P表'!J9=1,1,IF('S-P表'!J9=3,\"b\",0))","v":0},{"$f":"IF('S-P表'!K9=1,1,IF('S-P表'!K9=3,\"b\",0))","v":0},{"$f":"IF('S-P表'!L9=1,1,IF('S-P表'!L9=3,\"b\",0))","v":0},{"$f":"IF('S-P表'!M9=1,1,IF('S-P表'!M9=3,\"b\",0))","v":0},{"$f":"IF('S-P表'!N9=1,1,IF('S-P表'!N9=3,\"b\",0))","v":0},{"$f":"IF('S-P表'!O9=1,1,IF('S-P表'!O9=3,\"b\",0))","v":0},{"$f":"IF('S-P表'!P9=1,1,IF('S-P表'!P9=3,\"b\",0))","v":0},{"$f":"IF('S-P表'!Q9=1,1,IF('S-P表'!Q9=3,\"b\",0))","v":0},{"$f":"IF('S-P表'!R9=1,1,IF('S-P表'!R9=3,\"b\",0))","v":0},{"$f":"IF('S-P表'!S9=1,1,IF('S-P表'!S9=3,\"b\",0))","v":0},{"$f":"IF('S-P表'!T9=1,1,IF('S-P表'!T9=3,\"b\",0))","v":0},{"$f":"IF('S-P表'!U9=1,1,IF('S-P表'!U9=3,\"b\",0))","v":0},{"$f":"IF('S-P表'!V9=1,1,IF('S-P表'!V9=3,\"b\",0))","v":0},{"$f":"IF('S-P表'!W9=1,1,IF('S-P表'!W9=3,\"b\",0))","v":0},{"$f":"IF('S-P表'!X9=1,1,IF('S-P表'!X9=3,\"b\",0))","v":0},{"$f":"IF('S-P表'!Y9=1,1,IF('S-P表'!Y9=3,\"b\",0))","v":0},{"$f":"IF('S-P表'!Z9=1,1,IF('S-P表'!Z9=3,\"b\",0))","v":0},{"$f":"IF('S-P表'!AA9=1,1,IF('S-P表'!AA9=3,\"b\",0))","v":0},{"$f":"IF('S-P表'!AB9=1,1,IF('S-P表'!AB9=3,\"b\",0))","v":0},{"$f":"IF('S-P表'!AC9=1,1,IF('S-P表'!AC9=3,\"b\",0))","v":0},{"$f":"IF('S-P表'!AD9=1,1,IF('S-P表'!AD9=3,\"b\",0))","v":0},{"$f":"IF('S-P表'!AE9=1,1,IF('S-P表'!AE9=3,\"b\",0))","v":0},{"$f":"IF('S-P表'!AF9=1,1,IF('S-P表'!AF9=3,\"b\",0))","v":0},{"$f":"IF('S-P表'!AG9=1,1,IF('S-P表'!AG9=3,\"b\",0))","v":0},{"$f":"IF('S-P表'!AH9=1,1,IF('S-P表'!AH9=3,\"b\",0))","v":0},{"$f":"IF('S-P表'!AI9=1,1,IF('S-P表'!AI9=3,\"b\",0))","v":0},{"$f":"IF('S-P表'!AJ9=1,1,IF('S-P表'!AJ9=3,\"b\",0))","v":0},{"$f":"IF('S-P表'!AK9=1,1,IF('S-P表'!AK9=3,\"b\",0))","v":0},{"$f":"IF('S-P表'!AL9=1,1,IF('S-P表'!AL9=3,\"b\",0))","v":0},{"$f":"IF('S-P表'!AM9=1,1,IF('S-P表'!AM9=3,\"b\",0))","v":0},{"$f":"IF('S-P表'!AN9=1,1,IF('S-P表'!AN9=3,\"b\",0))","v":0},{"$f":"IF('S-P表'!AO9=1,1,IF('S-P表'!AO9=3,\"b\",0))","v":0},{"$f":"IF('S-P表'!AP9=1,1,IF('S-P表'!AP9=3,\"b\",0))","v":0},{"$f":"IF('S-P表'!AQ9=1,1,IF('S-P表'!AQ9=3,\"b\",0))","v":0},{"$f":"SUM(Sheet3!D9:'Sheet3'!AQ9)","v":0}]
[null,null,null,{"$f":"IF('S-P表'!D10=1,1,IF('S-P表'!D10=3,\"b\",0))","v":0},{"$f":"IF('S-P表'!E10=1,1,IF('S-P表'!E10=3,\"b\",0))","v":0},{"$f":"IF('S-P表'!F10=1,1,IF('S-P表'!F10=3,\"b\",0))","v":0},{"$f":"IF('S-P表'!G10=1,1,IF('S-P表'!G10=3,\"b\",0))","v":0},{"$f":"IF('S-P表'!H10=1,1,IF('S-P表'!H10=3,\"b\",0))","v":0},{"$f":"IF('S-P表'!I10=1,1,IF('S-P表'!I10=3,\"b\",0))","v":0},{"$f":"IF('S-P表'!J10=1,1,IF('S-P表'!J10=3,\"b\",0))","v":0},{"$f":"IF('S-P表'!K10=1,1,IF('S-P表'!K10=3,\"b\",0))","v":0},{"$f":"IF('S-P表'!L10=1,1,IF('S-P表'!L10=3,\"b\",0))","v":0},{"$f":"IF('S-P表'!M10=1,1,IF('S-P表'!M10=3,\"b\",0))","v":0},{"$f":"IF('S-P表'!N10=1,1,IF('S-P表'!N10=3,\"b\",0))","v":0},{"$f":"IF('S-P表'!O10=1,1,IF('S-P表'!O10=3,\"b\",0))","v":0},{"$f":"IF('S-P表'!P10=1,1,IF('S-P表'!P10=3,\"b\",0))","v":0},{"$f":"IF('S-P表'!Q10=1,1,IF('S-P表'!Q10=3,\"b\",0))","v":0},{"$f":"IF('S-P表'!R10=1,1,IF('S-P表'!R10=3,\"b\",0))","v":0},{"$f":"IF('S-P表'!S10=1,1,IF('S-P表'!S10=3,\"b\",0))","v":0},{"$f":"IF('S-P表'!T10=1,1,IF('S-P表'!T10=3,\"b\",0))","v":0},{"$f":"IF('S-P表'!U10=1,1,IF('S-P表'!U10=3,\"b\",0))","v":0},{"$f":"IF('S-P表'!V10=1,1,IF('S-P表'!V10=3,\"b\",0))","v":0},{"$f":"IF('S-P表'!W10=1,1,IF('S-P表'!W10=3,\"b\",0))","v":0},{"$f":"IF('S-P表'!X10=1,1,IF('S-P表'!X10=3,\"b\",0))","v":0},{"$f":"IF('S-P表'!Y10=1,1,IF('S-P表'!Y10=3,\"b\",0))","v":0},{"$f":"IF('S-P表'!Z10=1,1,IF('S-P表'!Z10=3,\"b\",0))","v":0},{"$f":"IF('S-P表'!AA10=1,1,IF('S-P表'!AA10=3,\"b\",0))","v":0},{"$f":"IF('S-P表'!AB10=1,1,IF('S-P表'!AB10=3,\"b\",0))","v":0},{"$f":"IF('S-P表'!AC10=1,1,IF('S-P表'!AC10=3,\"b\",0))","v":0},{"$f":"IF('S-P表'!AD10=1,1,IF('S-P表'!AD10=3,\"b\",0))","v":0},{"$f":"IF('S-P表'!AE10=1,1,IF('S-P表'!AE10=3,\"b\",0))","v":0},{"$f":"IF('S-P表'!AF10=1,1,IF('S-P表'!AF10=3,\"b\",0))","v":0},{"$f":"IF('S-P表'!AG10=1,1,IF('S-P表'!AG10=3,\"b\",0))","v":0},{"$f":"IF('S-P表'!AH10=1,1,IF('S-P表'!AH10=3,\"b\",0))","v":0},{"$f":"IF('S-P表'!AI10=1,1,IF('S-P表'!AI10=3,\"b\",0))","v":0},{"$f":"IF('S-P表'!AJ10=1,1,IF('S-P表'!AJ10=3,\"b\",0))","v":0},{"$f":"IF('S-P表'!AK10=1,1,IF('S-P表'!AK10=3,\"b\",0))","v":0},{"$f":"IF('S-P表'!AL10=1,1,IF('S-P表'!AL10=3,\"b\",0))","v":0},{"$f":"IF('S-P表'!AM10=1,1,IF('S-P表'!AM10=3,\"b\",0))","v":0},{"$f":"IF('S-P表'!AN10=1,1,IF('S-P表'!AN10=3,\"b\",0))","v":0},{"$f":"IF('S-P表'!AO10=1,1,IF('S-P表'!AO10=3,\"b\",0))","v":0},{"$f":"IF('S-P表'!AP10=1,1,IF('S-P表'!AP10=3,\"b\",0))","v":0},{"$f":"IF('S-P表'!AQ10=1,1,IF('S-P表'!AQ10=3,\"b\",0))","v":0},{"$f":"SUM(Sheet3!D10:'Sheet3'!AQ10)","v":0}]
[null,null,null,{"$f":"IF('S-P表'!D11=1,1,IF('S-P表'!D11=3,\"b\",0))","v":0},{"$f":"IF('S-P表'!E11=1,1,IF('S-P表'!E11=3,\"b\",0))","v":0},{"$f":"IF('S-P表'!F11=1,1,IF('S-P表'!F11=3,\"b\",0))","v":0},{"$f":"IF('S-P表'!G11=1,1,IF('S-P表'!G11=3,\"b\",0))","v":0},{"$f":"IF('S-P表'!H11=1,1,IF('S-P表'!H11=3,\"b\",0))","v":0},{"$f":"IF('S-P表'!I11=1,1,IF('S-P表'!I11=3,\"b\",0))","v":0},{"$f":"IF('S-P表'!J11=1,1,IF('S-P表'!J11=3,\"b\",0))","v":0},{"$f":"IF('S-P表'!K11=1,1,IF('S-P表'!K11=3,\"b\",0))","v":0},{"$f":"IF('S-P表'!L11=1,1,IF('S-P表'!L11=3,\"b\",0))","v":0},{"$f":"IF('S-P表'!M11=1,1,IF('S-P表'!M11=3,\"b\",0))","v":0},{"$f":"IF('S-P表'!N11=1,1,IF('S-P表'!N11=3,\"b\",0))","v":0},{"$f":"IF('S-P表'!O11=1,1,IF('S-P表'!O11=3,\"b\",0))","v":0},{"$f":"IF('S-P表'!P11=1,1,IF('S-P表'!P11=3,\"b\",0))","v":0},{"$f":"IF('S-P表'!Q11=1,1,IF('S-P表'!Q11=3,\"b\",0))","v":0},{"$f":"IF('S-P表'!R11=1,1,IF('S-P表'!R11=3,\"b\",0))","v":0},{"$f":"IF('S-P表'!S11=1,1,IF('S-P表'!S11=3,\"b\",0))","v":0},{"$f":"IF('S-P表'!T11=1,1,IF('S-P表'!T11=3,\"b\",0))","v":0},{"$f":"IF('S-P表'!U11=1,1,IF('S-P表'!U11=3,\"b\",0))","v":0},{"$f":"IF('S-P表'!V11=1,1,IF('S-P表'!V11=3,\"b\",0))","v":0},{"$f":"IF('S-P表'!W11=1,1,IF('S-P表'!W11=3,\"b\",0))","v":0},{"$f":"IF('S-P表'!X11=1,1,IF('S-P表'!X11=3,\"b\",0))","v":0},{"$f":"IF('S-P表'!Y11=1,1,IF('S-P表'!Y11=3,\"b\",0))","v":0},{"$f":"IF('S-P表'!Z11=1,1,IF('S-P表'!Z11=3,\"b\",0))","v":0},{"$f":"IF('S-P表'!AA11=1,1,IF('S-P表'!AA11=3,\"b\",0))","v":0},{"$f":"IF('S-P表'!AB11=1,1,IF('S-P表'!AB11=3,\"b\",0))","v":0},{"$f":"IF('S-P表'!AC11=1,1,IF('S-P表'!AC11=3,\"b\",0))","v":0},{"$f":"IF('S-P表'!AD11=1,1,IF('S-P表'!AD11=3,\"b\",0))","v":0},{"$f":"IF('S-P表'!AE11=1,1,IF('S-P表'!AE11=3,\"b\",0))","v":0},{"$f":"IF('S-P表'!AF11=1,1,IF('S-P表'!AF11=3,\"b\",0))","v":0},{"$f":"IF('S-P表'!AG11=1,1,IF('S-P表'!AG11=3,\"b\",0))","v":0},{"$f":"IF('S-P表'!AH11=1,1,IF('S-P表'!AH11=3,\"b\",0))","v":0},{"$f":"IF('S-P表'!AI11=1,1,IF('S-P表'!AI11=3,\"b\",0))","v":0},{"$f":"IF('S-P表'!AJ11=1,1,IF('S-P表'!AJ11=3,\"b\",0))","v":0},{"$f":"IF('S-P表'!AK11=1,1,IF('S-P表'!AK11=3,\"b\",0))","v":0},{"$f":"IF('S-P表'!AL11=1,1,IF('S-P表'!AL11=3,\"b\",0))","v":0},{"$f":"IF('S-P表'!AM11=1,1,IF('S-P表'!AM11=3,\"b\",0))","v":0},{"$f":"IF('S-P表'!AN11=1,1,IF('S-P表'!AN11=3,\"b\",0))","v":0},{"$f":"IF('S-P表'!AO11=1,1,IF('S-P表'!AO11=3,\"b\",0))","v":0},{"$f":"IF('S-P表'!AP11=1,1,IF('S-P表'!AP11=3,\"b\",0))","v":0},{"$f":"IF('S-P表'!AQ11=1,1,IF('S-P表'!AQ11=3,\"b\",0))","v":0},{"$f":"SUM(Sheet3!D11:'Sheet3'!AQ11)","v":0}]
[null,null,null,{"$f":"IF('S-P表'!D12=1,1,IF('S-P表'!D12=3,\"b\",0))","v":0},{"$f":"IF('S-P表'!E12=1,1,IF('S-P表'!E12=3,\"b\",0))","v":0},{"$f":"IF('S-P表'!F12=1,1,IF('S-P表'!F12=3,\"b\",0))","v":0},{"$f":"IF('S-P表'!G12=1,1,IF('S-P表'!G12=3,\"b\",0))","v":0},{"$f":"IF('S-P表'!H12=1,1,IF('S-P表'!H12=3,\"b\",0))","v":0},{"$f":"IF('S-P表'!I12=1,1,IF('S-P表'!I12=3,\"b\",0))","v":0},{"$f":"IF('S-P表'!J12=1,1,IF('S-P表'!J12=3,\"b\",0))","v":0},{"$f":"IF('S-P表'!K12=1,1,IF('S-P表'!K12=3,\"b\",0))","v":0},{"$f":"IF('S-P表'!L12=1,1,IF('S-P表'!L12=3,\"b\",0))","v":0},{"$f":"IF('S-P表'!M12=1,1,IF('S-P表'!M12=3,\"b\",0))","v":0},{"$f":"IF('S-P表'!N12=1,1,IF('S-P表'!N12=3,\"b\",0))","v":0},{"$f":"IF('S-P表'!O12=1,1,IF('S-P表'!O12=3,\"b\",0))","v":0},{"$f":"IF('S-P表'!P12=1,1,IF('S-P表'!P12=3,\"b\",0))","v":0},{"$f":"IF('S-P表'!Q12=1,1,IF('S-P表'!Q12=3,\"b\",0))","v":0},{"$f":"IF('S-P表'!R12=1,1,IF('S-P表'!R12=3,\"b\",0))","v":0},{"$f":"IF('S-P表'!S12=1,1,IF('S-P表'!S12=3,\"b\",0))","v":0},{"$f":"IF('S-P表'!T12=1,1,IF('S-P表'!T12=3,\"b\",0))","v":0},{"$f":"IF('S-P表'!U12=1,1,IF('S-P表'!U12=3,\"b\",0))","v":0},{"$f":"IF('S-P表'!V12=1,1,IF('S-P表'!V12=3,\"b\",0))","v":0},{"$f":"IF('S-P表'!W12=1,1,IF('S-P表'!W12=3,\"b\",0))","v":0},{"$f":"IF('S-P表'!X12=1,1,IF('S-P表'!X12=3,\"b\",0))","v":0},{"$f":"IF('S-P表'!Y12=1,1,IF('S-P表'!Y12=3,\"b\",0))","v":0},{"$f":"IF('S-P表'!Z12=1,1,IF('S-P表'!Z12=3,\"b\",0))","v":0},{"$f":"IF('S-P表'!AA12=1,1,IF('S-P表'!AA12=3,\"b\",0))","v":0},{"$f":"IF('S-P表'!AB12=1,1,IF('S-P表'!AB12=3,\"b\",0))","v":0},{"$f":"IF('S-P表'!AC12=1,1,IF('S-P表'!AC12=3,\"b\",0))","v":0},{"$f":"IF('S-P表'!AD12=1,1,IF('S-P表'!AD12=3,\"b\",0))","v":0},{"$f":"IF('S-P表'!AE12=1,1,IF('S-P表'!AE12=3,\"b\",0))","v":0},{"$f":"IF('S-P表'!AF12=1,1,IF('S-P表'!AF12=3,\"b\",0))","v":0},{"$f":"IF('S-P表'!AG12=1,1,IF('S-P表'!AG12=3,\"b\",0))","v":0},{"$f":"IF('S-P表'!AH12=1,1,IF('S-P表'!AH12=3,\"b\",0))","v":0},{"$f":"IF('S-P表'!AI12=1,1,IF('S-P表'!AI12=3,\"b\",0))","v":0},{"$f":"IF('S-P表'!AJ12=1,1,IF('S-P表'!AJ12=3,\"b\",0))","v":0},{"$f":"IF('S-P表'!AK12=1,1,IF('S-P表'!AK12=3,\"b\",0))","v":0},{"$f":"IF('S-P表'!AL12=1,1,IF('S-P表'!AL12=3,\"b\",0))","v":0},{"$f":"IF('S-P表'!AM12=1,1,IF('S-P表'!AM12=3,\"b\",0))","v":0},{"$f":"IF('S-P表'!AN12=1,1,IF('S-P表'!AN12=3,\"b\",0))","v":0},{"$f":"IF('S-P表'!AO12=1,1,IF('S-P表'!AO12=3,\"b\",0))","v":0},{"$f":"IF('S-P表'!AP12=1,1,IF('S-P表'!AP12=3,\"b\",0))","v":0},{"$f":"IF('S-P表'!AQ12=1,1,IF('S-P表'!AQ12=3,\"b\",0))","v":0},{"$f":"SUM(Sheet3!D12:'Sheet3'!AQ12)","v":0}]
[null,null,null,{"$f":"IF('S-P表'!D13=1,1,IF('S-P表'!D13=3,\"b\",0))","v":0},{"$f":"IF('S-P表'!E13=1,1,IF('S-P表'!E13=3,\"b\",0))","v":0},{"$f":"IF('S-P表'!F13=1,1,IF('S-P表'!F13=3,\"b\",0))","v":0},{"$f":"IF('S-P表'!G13=1,1,IF('S-P表'!G13=3,\"b\",0))","v":0},{"$f":"IF('S-P表'!H13=1,1,IF('S-P表'!H13=3,\"b\",0))","v":0},{"$f":"IF('S-P表'!I13=1,1,IF('S-P表'!I13=3,\"b\",0))","v":0},{"$f":"IF('S-P表'!J13=1,1,IF('S-P表'!J13=3,\"b\",0))","v":0},{"$f":"IF('S-P表'!K13=1,1,IF('S-P表'!K13=3,\"b\",0))","v":0},{"$f":"IF('S-P表'!L13=1,1,IF('S-P表'!L13=3,\"b\",0))","v":0},{"$f":"IF('S-P表'!M13=1,1,IF('S-P表'!M13=3,\"b\",0))","v":0},{"$f":"IF('S-P表'!N13=1,1,IF('S-P表'!N13=3,\"b\",0))","v":0},{"$f":"IF('S-P表'!O13=1,1,IF('S-P表'!O13=3,\"b\",0))","v":0},{"$f":"IF('S-P表'!P13=1,1,IF('S-P表'!P13=3,\"b\",0))","v":0},{"$f":"IF('S-P表'!Q13=1,1,IF('S-P表'!Q13=3,\"b\",0))","v":0},{"$f":"IF('S-P表'!R13=1,1,IF('S-P表'!R13=3,\"b\",0))","v":0},{"$f":"IF('S-P表'!S13=1,1,IF('S-P表'!S13=3,\"b\",0))","v":0},{"$f":"IF('S-P表'!T13=1,1,IF('S-P表'!T13=3,\"b\",0))","v":0},{"$f":"IF('S-P表'!U13=1,1,IF('S-P表'!U13=3,\"b\",0))","v":0},{"$f":"IF('S-P表'!V13=1,1,IF('S-P表'!V13=3,\"b\",0))","v":0},{"$f":"IF('S-P表'!W13=1,1,IF('S-P表'!W13=3,\"b\",0))","v":0},{"$f":"IF('S-P表'!X13=1,1,IF('S-P表'!X13=3,\"b\",0))","v":0},{"$f":"IF('S-P表'!Y13=1,1,IF('S-P表'!Y13=3,\"b\",0))","v":0},{"$f":"IF('S-P表'!Z13=1,1,IF('S-P表'!Z13=3,\"b\",0))","v":0},{"$f":"IF('S-P表'!AA13=1,1,IF('S-P表'!AA13=3,\"b\",0))","v":0},{"$f":"IF('S-P表'!AB13=1,1,IF('S-P表'!AB13=3,\"b\",0))","v":0},{"$f":"IF('S-P表'!AC13=1,1,IF('S-P表'!AC13=3,\"b\",0))","v":0},{"$f":"IF('S-P表'!AD13=1,1,IF('S-P表'!AD13=3,\"b\",0))","v":0},{"$f":"IF('S-P表'!AE13=1,1,IF('S-P表'!AE13=3,\"b\",0))","v":0},{"$f":"IF('S-P表'!AF13=1,1,IF('S-P表'!AF13=3,\"b\",0))","v":0},{"$f":"IF('S-P表'!AG13=1,1,IF('S-P表'!AG13=3,\"b\",0))","v":0},{"$f":"IF('S-P表'!AH13=1,1,IF('S-P表'!AH13=3,\"b\",0))","v":0},{"$f":"IF('S-P表'!AI13=1,1,IF('S-P表'!AI13=3,\"b\",0))","v":0},{"$f":"IF('S-P表'!AJ13=1,1,IF('S-P表'!AJ13=3,\"b\",0))","v":0},{"$f":"IF('S-P表'!AK13=1,1,IF('S-P表'!AK13=3,\"b\",0))","v":0},{"$f":"IF('S-P表'!AL13=1,1,IF('S-P表'!AL13=3,\"b\",0))","v":0},{"$f":"IF('S-P表'!AM13=1,1,IF('S-P表'!AM13=3,\"b\",0))","v":0},{"$f":"IF('S-P表'!AN13=1,1,IF('S-P表'!AN13=3,\"b\",0))","v":0},{"$f":"IF('S-P表'!AO13=1,1,IF('S-P表'!AO13=3,\"b\",0))","v":0},{"$f":"IF('S-P表'!AP13=1,1,IF('S-P表'!AP13=3,\"b\",0))","v":0},{"$f":"IF('S-P表'!AQ13=1,1,IF('S-P表'!AQ13=3,\"b\",0))","v":0},{"$f":"SUM(Sheet3!D13:'Sheet3'!AQ13)","v":0}]
[null,null,null,{"$f":"IF('S-P表'!D14=1,1,IF('S-P表'!D14=3,\"b\",0))","v":0},{"$f":"IF('S-P表'!E14=1,1,IF('S-P表'!E14=3,\"b\",0))","v":0},{"$f":"IF('S-P表'!F14=1,1,IF('S-P表'!F14=3,\"b\",0))","v":0},{"$f":"IF('S-P表'!G14=1,1,IF('S-P表'!G14=3,\"b\",0))","v":0},{"$f":"IF('S-P表'!H14=1,1,IF('S-P表'!H14=3,\"b\",0))","v":0},{"$f":"IF('S-P表'!I14=1,1,IF('S-P表'!I14=3,\"b\",0))","v":0},{"$f":"IF('S-P表'!J14=1,1,IF('S-P表'!J14=3,\"b\",0))","v":0},{"$f":"IF('S-P表'!K14=1,1,IF('S-P表'!K14=3,\"b\",0))","v":0},{"$f":"IF('S-P表'!L14=1,1,IF('S-P表'!L14=3,\"b\",0))","v":0},{"$f":"IF('S-P表'!M14=1,1,IF('S-P表'!M14=3,\"b\",0))","v":0},{"$f":"IF('S-P表'!N14=1,1,IF('S-P表'!N14=3,\"b\",0))","v":0},{"$f":"IF('S-P表'!O14=1,1,IF('S-P表'!O14=3,\"b\",0))","v":0},{"$f":"IF('S-P表'!P14=1,1,IF('S-P表'!P14=3,\"b\",0))","v":0},{"$f":"IF('S-P表'!Q14=1,1,IF('S-P表'!Q14=3,\"b\",0))","v":0},{"$f":"IF('S-P表'!R14=1,1,IF('S-P表'!R14=3,\"b\",0))","v":0},{"$f":"IF('S-P表'!S14=1,1,IF('S-P表'!S14=3,\"b\",0))","v":0},{"$f":"IF('S-P表'!T14=1,1,IF('S-P表'!T14=3,\"b\",0))","v":0},{"$f":"IF('S-P表'!U14=1,1,IF('S-P表'!U14=3,\"b\",0))","v":0},{"$f":"IF('S-P表'!V14=1,1,IF('S-P表'!V14=3,\"b\",0))","v":0},{"$f":"IF('S-P表'!W14=1,1,IF('S-P表'!W14=3,\"b\",0))","v":0},{"$f":"IF('S-P表'!X14=1,1,IF('S-P表'!X14=3,\"b\",0))","v":0},{"$f":"IF('S-P表'!Y14=1,1,IF('S-P表'!Y14=3,\"b\",0))","v":0},{"$f":"IF('S-P表'!Z14=1,1,IF('S-P表'!Z14=3,\"b\",0))","v":0},{"$f":"IF('S-P表'!AA14=1,1,IF('S-P表'!AA14=3,\"b\",0))","v":0},{"$f":"IF('S-P表'!AB14=1,1,IF('S-P表'!AB14=3,\"b\",0))","v":0},{"$f":"IF('S-P表'!AC14=1,1,IF('S-P表'!AC14=3,\"b\",0))","v":0},{"$f":"IF('S-P表'!AD14=1,1,IF('S-P表'!AD14=3,\"b\",0))","v":0},{"$f":"IF('S-P表'!AE14=1,1,IF('S-P表'!AE14=3,\"b\",0))","v":0},{"$f":"IF('S-P表'!AF14=1,1,IF('S-P表'!AF14=3,\"b\",0))","v":0},{"$f":"IF('S-P表'!AG14=1,1,IF('S-P表'!AG14=3,\"b\",0))","v":0},{"$f":"IF('S-P表'!AH14=1,1,IF('S-P表'!AH14=3,\"b\",0))","v":0},{"$f":"IF('S-P表'!AI14=1,1,IF('S-P表'!AI14=3,\"b\",0))","v":0},{"$f":"IF('S-P表'!AJ14=1,1,IF('S-P表'!AJ14=3,\"b\",0))","v":0},{"$f":"IF('S-P表'!AK14=1,1,IF('S-P表'!AK14=3,\"b\",0))","v":0},{"$f":"IF('S-P表'!AL14=1,1,IF('S-P表'!AL14=3,\"b\",0))","v":0},{"$f":"IF('S-P表'!AM14=1,1,IF('S-P表'!AM14=3,\"b\",0))","v":0},{"$f":"IF('S-P表'!AN14=1,1,IF('S-P表'!AN14=3,\"b\",0))","v":0},{"$f":"IF('S-P表'!AO14=1,1,IF('S-P表'!AO14=3,\"b\",0))","v":0},{"$f":"IF('S-P表'!AP14=1,1,IF('S-P表'!AP14=3,\"b\",0))","v":0},{"$f":"IF('S-P表'!AQ14=1,1,IF('S-P表'!AQ14=3,\"b\",0))","v":0},{"$f":"SUM(Sheet3!D14:'Sheet3'!AQ14)","v":0}]
[null,null,null,{"$f":"IF('S-P表'!D15=1,1,IF('S-P表'!D15=3,\"b\",0))","v":0},{"$f":"IF('S-P表'!E15=1,1,IF('S-P表'!E15=3,\"b\",0))","v":0},{"$f":"IF('S-P表'!F15=1,1,IF('S-P表'!F15=3,\"b\",0))","v":0},{"$f":"IF('S-P表'!G15=1,1,IF('S-P表'!G15=3,\"b\",0))","v":0},{"$f":"IF('S-P表'!H15=1,1,IF('S-P表'!H15=3,\"b\",0))","v":0},{"$f":"IF('S-P表'!I15=1,1,IF('S-P表'!I15=3,\"b\",0))","v":0},{"$f":"IF('S-P表'!J15=1,1,IF('S-P表'!J15=3,\"b\",0))","v":0},{"$f":"IF('S-P表'!K15=1,1,IF('S-P表'!K15=3,\"b\",0))","v":0},{"$f":"IF('S-P表'!L15=1,1,IF('S-P表'!L15=3,\"b\",0))","v":0},{"$f":"IF('S-P表'!M15=1,1,IF('S-P表'!M15=3,\"b\",0))","v":0},{"$f":"IF('S-P表'!N15=1,1,IF('S-P表'!N15=3,\"b\",0))","v":0},{"$f":"IF('S-P表'!O15=1,1,IF('S-P表'!O15=3,\"b\",0))","v":0},{"$f":"IF('S-P表'!P15=1,1,IF('S-P表'!P15=3,\"b\",0))","v":0},{"$f":"IF('S-P表'!Q15=1,1,IF('S-P表'!Q15=3,\"b\",0))","v":0},{"$f":"IF('S-P表'!R15=1,1,IF('S-P表'!R15=3,\"b\",0))","v":0},{"$f":"IF('S-P表'!S15=1,1,IF('S-P表'!S15=3,\"b\",0))","v":0},{"$f":"IF('S-P表'!T15=1,1,IF('S-P表'!T15=3,\"b\",0))","v":0},{"$f":"IF('S-P表'!U15=1,1,IF('S-P表'!U15=3,\"b\",0))","v":0},{"$f":"IF('S-P表'!V15=1,1,IF('S-P表'!V15=3,\"b\",0))","v":0},{"$f":"IF('S-P表'!W15=1,1,IF('S-P表'!W15=3,\"b\",0))","v":0},{"$f":"IF('S-P表'!X15=1,1,IF('S-P表'!X15=3,\"b\",0))","v":0},{"$f":"IF('S-P表'!Y15=1,1,IF('S-P表'!Y15=3,\"b\",0))","v":0},{"$f":"IF('S-P表'!Z15=1,1,IF('S-P表'!Z15=3,\"b\",0))","v":0},{"$f":"IF('S-P表'!AA15=1,1,IF('S-P表'!AA15=3,\"b\",0))","v":0},{"$f":"IF('S-P表'!AB15=1,1,IF('S-P表'!AB15=3,\"b\",0))","v":0},{"$f":"IF('S-P表'!AC15=1,1,IF('S-P表'!AC15=3,\"b\",0))","v":0},{"$f":"IF('S-P表'!AD15=1,1,IF('S-P表'!AD15=3,\"b\",0))","v":0},{"$f":"IF('S-P表'!AE15=1,1,IF('S-P表'!AE15=3,\"b\",0))","v":0},{"$f":"IF('S-P表'!AF15=1,1,IF('S-P表'!AF15=3,\"b\",0))","v":0},{"$f":"IF('S-P表'!AG15=1,1,IF('S-P表'!AG15=3,\"b\",0))","v":0},{"$f":"IF('S-P表'!AH15=1,1,IF('S-P表'!AH15=3,\"b\",0))","v":0},{"$f":"IF('S-P表'!AI15=1,1,IF('S-P表'!AI15=3,\"b\",0))","v":0},{"$f":"IF('S-P表'!AJ15=1,1,IF('S-P表'!AJ15=3,\"b\",0))","v":0},{"$f":"IF('S-P表'!AK15=1,1,IF('S-P表'!AK15=3,\"b\",0))","v":0},{"$f":"IF('S-P表'!AL15=1,1,IF('S-P表'!AL15=3,\"b\",0))","v":0},{"$f":"IF('S-P表'!AM15=1,1,IF('S-P表'!AM15=3,\"b\",0))","v":0},{"$f":"IF('S-P表'!AN15=1,1,IF('S-P表'!AN15=3,\"b\",0))","v":0},{"$f":"IF('S-P表'!AO15=1,1,IF('S-P表'!AO15=3,\"b\",0))","v":0},{"$f":"IF('S-P表'!AP15=1,1,IF('S-P表'!AP15=3,\"b\",0))","v":0},{"$f":"IF('S-P表'!AQ15=1,1,IF('S-P表'!AQ15=3,\"b\",0))","v":0},{"$f":"SUM(Sheet3!D15:'Sheet3'!AQ15)","v":0}]
[null,null,null,{"$f":"IF('S-P表'!D16=1,1,IF('S-P表'!D16=3,\"b\",0))","v":0},{"$f":"IF('S-P表'!E16=1,1,IF('S-P表'!E16=3,\"b\",0))","v":0},{"$f":"IF('S-P表'!F16=1,1,IF('S-P表'!F16=3,\"b\",0))","v":0},{"$f":"IF('S-P表'!G16=1,1,IF('S-P表'!G16=3,\"b\",0))","v":0},{"$f":"IF('S-P表'!H16=1,1,IF('S-P表'!H16=3,\"b\",0))","v":0},{"$f":"IF('S-P表'!I16=1,1,IF('S-P表'!I16=3,\"b\",0))","v":0},{"$f":"IF('S-P表'!J16=1,1,IF('S-P表'!J16=3,\"b\",0))","v":0},{"$f":"IF('S-P表'!K16=1,1,IF('S-P表'!K16=3,\"b\",0))","v":0},{"$f":"IF('S-P表'!L16=1,1,IF('S-P表'!L16=3,\"b\",0))","v":0},{"$f":"IF('S-P表'!M16=1,1,IF('S-P表'!M16=3,\"b\",0))","v":0},{"$f":"IF('S-P表'!N16=1,1,IF('S-P表'!N16=3,\"b\",0))","v":0},{"$f":"IF('S-P表'!O16=1,1,IF('S-P表'!O16=3,\"b\",0))","v":0},{"$f":"IF('S-P表'!P16=1,1,IF('S-P表'!P16=3,\"b\",0))","v":0},{"$f":"IF('S-P表'!Q16=1,1,IF('S-P表'!Q16=3,\"b\",0))","v":0},{"$f":"IF('S-P表'!R16=1,1,IF('S-P表'!R16=3,\"b\",0))","v":0},{"$f":"IF('S-P表'!S16=1,1,IF('S-P表'!S16=3,\"b\",0))","v":0},{"$f":"IF('S-P表'!T16=1,1,IF('S-P表'!T16=3,\"b\",0))","v":0},{"$f":"IF('S-P表'!U16=1,1,IF('S-P表'!U16=3,\"b\",0))","v":0},{"$f":"IF('S-P表'!V16=1,1,IF('S-P表'!V16=3,\"b\",0))","v":0},{"$f":"IF('S-P表'!W16=1,1,IF('S-P表'!W16=3,\"b\",0))","v":0},{"$f":"IF('S-P表'!X16=1,1,IF('S-P表'!X16=3,\"b\",0))","v":0},{"$f":"IF('S-P表'!Y16=1,1,IF('S-P表'!Y16=3,\"b\",0))","v":0},{"$f":"IF('S-P表'!Z16=1,1,IF('S-P表'!Z16=3,\"b\",0))","v":0},{"$f":"IF('S-P表'!AA16=1,1,IF('S-P表'!AA16=3,\"b\",0))","v":0},{"$f":"IF('S-P表'!AB16=1,1,IF('S-P表'!AB16=3,\"b\",0))","v":0},{"$f":"IF('S-P表'!AC16=1,1,IF('S-P表'!AC16=3,\"b\",0))","v":0},{"$f":"IF('S-P表'!AD16=1,1,IF('S-P表'!AD16=3,\"b\",0))","v":0},{"$f":"IF('S-P表'!AE16=1,1,IF('S-P表'!AE16=3,\"b\",0))","v":0},{"$f":"IF('S-P表'!AF16=1,1,IF('S-P表'!AF16=3,\"b\",0))","v":0},{"$f":"IF('S-P表'!AG16=1,1,IF('S-P表'!AG16=3,\"b\",0))","v":0},{"$f":"IF('S-P表'!AH16=1,1,IF('S-P表'!AH16=3,\"b\",0))","v":0},{"$f":"IF('S-P表'!AI16=1,1,IF('S-P表'!AI16=3,\"b\",0))","v":0},{"$f":"IF('S-P表'!AJ16=1,1,IF('S-P表'!AJ16=3,\"b\",0))","v":0},{"$f":"IF('S-P表'!AK16=1,1,IF('S-P表'!AK16=3,\"b\",0))","v":0},{"$f":"IF('S-P表'!AL16=1,1,IF('S-P表'!AL16=3,\"b\",0))","v":0},{"$f":"IF('S-P表'!AM16=1,1,IF('S-P表'!AM16=3,\"b\",0))","v":0},{"$f":"IF('S-P表'!AN16=1,1,IF('S-P表'!AN16=3,\"b\",0))","v":0},{"$f":"IF('S-P表'!AO16=1,1,IF('S-P表'!AO16=3,\"b\",0))","v":0},{"$f":"IF('S-P表'!AP16=1,1,IF('S-P表'!AP16=3,\"b\",0))","v":0},{"$f":"IF('S-P表'!AQ16=1,1,IF('S-P表'!AQ16=3,\"b\",0))","v":0},{"$f":"SUM(Sheet3!D16:'Sheet3'!AQ16)","v":0}]
[null,null,null,{"$f":"IF('S-P表'!D17=1,1,IF('S-P表'!D17=3,\"b\",0))","v":0},{"$f":"IF('S-P表'!E17=1,1,IF('S-P表'!E17=3,\"b\",0))","v":0},{"$f":"IF('S-P表'!F17=1,1,IF('S-P表'!F17=3,\"b\",0))","v":0},{"$f":"IF('S-P表'!G17=1,1,IF('S-P表'!G17=3,\"b\",0))","v":0},{"$f":"IF('S-P表'!H17=1,1,IF('S-P表'!H17=3,\"b\",0))","v":0},{"$f":"IF('S-P表'!I17=1,1,IF('S-P表'!I17=3,\"b\",0))","v":0},{"$f":"IF('S-P表'!J17=1,1,IF('S-P表'!J17=3,\"b\",0))","v":0},{"$f":"IF('S-P表'!K17=1,1,IF('S-P表'!K17=3,\"b\",0))","v":0},{"$f":"IF('S-P表'!L17=1,1,IF('S-P表'!L17=3,\"b\",0))","v":0},{"$f":"IF('S-P表'!M17=1,1,IF('S-P表'!M17=3,\"b\",0))","v":0},{"$f":"IF('S-P表'!N17=1,1,IF('S-P表'!N17=3,\"b\",0))","v":0},{"$f":"IF('S-P表'!O17=1,1,IF('S-P表'!O17=3,\"b\",0))","v":0},{"$f":"IF('S-P表'!P17=1,1,IF('S-P表'!P17=3,\"b\",0))","v":0},{"$f":"IF('S-P表'!Q17=1,1,IF('S-P表'!Q17=3,\"b\",0))","v":0},{"$f":"IF('S-P表'!R17=1,1,IF('S-P表'!R17=3,\"b\",0))","v":0},{"$f":"IF('S-P表'!S17=1,1,IF('S-P表'!S17=3,\"b\",0))","v":0},{"$f":"IF('S-P表'!T17=1,1,IF('S-P表'!T17=3,\"b\",0))","v":0},{"$f":"IF('S-P表'!U17=1,1,IF('S-P表'!U17=3,\"b\",0))","v":0},{"$f":"IF('S-P表'!V17=1,1,IF('S-P表'!V17=3,\"b\",0))","v":0},{"$f":"IF('S-P表'!W17=1,1,IF('S-P表'!W17=3,\"b\",0))","v":0},{"$f":"IF('S-P表'!X17=1,1,IF('S-P表'!X17=3,\"b\",0))","v":0},{"$f":"IF('S-P表'!Y17=1,1,IF('S-P表'!Y17=3,\"b\",0))","v":0},{"$f":"IF('S-P表'!Z17=1,1,IF('S-P表'!Z17=3,\"b\",0))","v":0},{"$f":"IF('S-P表'!AA17=1,1,IF('S-P表'!AA17=3,\"b\",0))","v":0},{"$f":"IF('S-P表'!AB17=1,1,IF('S-P表'!AB17=3,\"b\",0))","v":0},{"$f":"IF('S-P表'!AC17=1,1,IF('S-P表'!AC17=3,\"b\",0))","v":0},{"$f":"IF('S-P表'!AD17=1,1,IF('S-P表'!AD17=3,\"b\",0))","v":0},{"$f":"IF('S-P表'!AE17=1,1,IF('S-P表'!AE17=3,\"b\",0))","v":0},{"$f":"IF('S-P表'!AF17=1,1,IF('S-P表'!AF17=3,\"b\",0))","v":0},{"$f":"IF('S-P表'!AG17=1,1,IF('S-P表'!AG17=3,\"b\",0))","v":0},{"$f":"IF('S-P表'!AH17=1,1,IF('S-P表'!AH17=3,\"b\",0))","v":0},{"$f":"IF('S-P表'!AI17=1,1,IF('S-P表'!AI17=3,\"b\",0))","v":0},{"$f":"IF('S-P表'!AJ17=1,1,IF('S-P表'!AJ17=3,\"b\",0))","v":0},{"$f":"IF('S-P表'!AK17=1,1,IF('S-P表'!AK17=3,\"b\",0))","v":0},{"$f":"IF('S-P表'!AL17=1,1,IF('S-P表'!AL17=3,\"b\",0))","v":0},{"$f":"IF('S-P表'!AM17=1,1,IF('S-P表'!AM17=3,\"b\",0))","v":0},{"$f":"IF('S-P表'!AN17=1,1,IF('S-P表'!AN17=3,\"b\",0))","v":0},{"$f":"IF('S-P表'!AO17=1,1,IF('S-P表'!AO17=3,\"b\",0))","v":0},{"$f":"IF('S-P表'!AP17=1,1,IF('S-P表'!AP17=3,\"b\",0))","v":0},{"$f":"IF('S-P表'!AQ17=1,1,IF('S-P表'!AQ17=3,\"b\",0))","v":0},{"$f":"SUM(Sheet3!D17:'Sheet3'!AQ17)","v":0}]
[null,null,null,{"$f":"IF('S-P表'!D18=1,1,IF('S-P表'!D18=3,\"b\",0))","v":0},{"$f":"IF('S-P表'!E18=1,1,IF('S-P表'!E18=3,\"b\",0))","v":0},{"$f":"IF('S-P表'!F18=1,1,IF('S-P表'!F18=3,\"b\",0))","v":0},{"$f":"IF('S-P表'!G18=1,1,IF('S-P表'!G18=3,\"b\",0))","v":0},{"$f":"IF('S-P表'!H18=1,1,IF('S-P表'!H18=3,\"b\",0))","v":0},{"$f":"IF('S-P表'!I18=1,1,IF('S-P表'!I18=3,\"b\",0))","v":0},{"$f":"IF('S-P表'!J18=1,1,IF('S-P表'!J18=3,\"b\",0))","v":0},{"$f":"IF('S-P表'!K18=1,1,IF('S-P表'!K18=3,\"b\",0))","v":0},{"$f":"IF('S-P表'!L18=1,1,IF('S-P表'!L18=3,\"b\",0))","v":0},{"$f":"IF('S-P表'!M18=1,1,IF('S-P表'!M18=3,\"b\",0))","v":0},{"$f":"IF('S-P表'!N18=1,1,IF('S-P表'!N18=3,\"b\",0))","v":0},{"$f":"IF('S-P表'!O18=1,1,IF('S-P表'!O18=3,\"b\",0))","v":0},{"$f":"IF('S-P表'!P18=1,1,IF('S-P表'!P18=3,\"b\",0))","v":0},{"$f":"IF('S-P表'!Q18=1,1,IF('S-P表'!Q18=3,\"b\",0))","v":0},{"$f":"IF('S-P表'!R18=1,1,IF('S-P表'!R18=3,\"b\",0))","v":0},{"$f":"IF('S-P表'!S18=1,1,IF('S-P表'!S18=3,\"b\",0))","v":0},{"$f":"IF('S-P表'!T18=1,1,IF('S-P表'!T18=3,\"b\",0))","v":0},{"$f":"IF('S-P表'!U18=1,1,IF('S-P表'!U18=3,\"b\",0))","v":0},{"$f":"IF('S-P表'!V18=1,1,IF('S-P表'!V18=3,\"b\",0))","v":0},{"$f":"IF('S-P表'!W18=1,1,IF('S-P表'!W18=3,\"b\",0))","v":0},{"$f":"IF('S-P表'!X18=1,1,IF('S-P表'!X18=3,\"b\",0))","v":0},{"$f":"IF('S-P表'!Y18=1,1,IF('S-P表'!Y18=3,\"b\",0))","v":0},{"$f":"IF('S-P表'!Z18=1,1,IF('S-P表'!Z18=3,\"b\",0))","v":0},{"$f":"IF('S-P表'!AA18=1,1,IF('S-P表'!AA18=3,\"b\",0))","v":0},{"$f":"IF('S-P表'!AB18=1,1,IF('S-P表'!AB18=3,\"b\",0))","v":0},{"$f":"IF('S-P表'!AC18=1,1,IF('S-P表'!AC18=3,\"b\",0))","v":0},{"$f":"IF('S-P表'!AD18=1,1,IF('S-P表'!AD18=3,\"b\",0))","v":0},{"$f":"IF('S-P表'!AE18=1,1,IF('S-P表'!AE18=3,\"b\",0))","v":0},{"$f":"IF('S-P表'!AF18=1,1,IF('S-P表'!AF18=3,\"b\",0))","v":0},{"$f":"IF('S-P表'!AG18=1,1,IF('S-P表'!AG18=3,\"b\",0))","v":0},{"$f":"IF('S-P表'!AH18=1,1,IF('S-P表'!AH18=3,\"b\",0))","v":0},{"$f":"IF('S-P表'!AI18=1,1,IF('S-P表'!AI18=3,\"b\",0))","v":0},{"$f":"IF('S-P表'!AJ18=1,1,IF('S-P表'!AJ18=3,\"b\",0))","v":0},{"$f":"IF('S-P表'!AK18=1,1,IF('S-P表'!AK18=3,\"b\",0))","v":0},{"$f":"IF('S-P表'!AL18=1,1,IF('S-P表'!AL18=3,\"b\",0))","v":0},{"$f":"IF('S-P表'!AM18=1,1,IF('S-P表'!AM18=3,\"b\",0))","v":0},{"$f":"IF('S-P表'!AN18=1,1,IF('S-P表'!AN18=3,\"b\",0))","v":0},{"$f":"IF('S-P表'!AO18=1,1,IF('S-P表'!AO18=3,\"b\",0))","v":0},{"$f":"IF('S-P表'!AP18=1,1,IF('S-P表'!AP18=3,\"b\",0))","v":0},{"$f":"IF('S-P表'!AQ18=1,1,IF('S-P表'!AQ18=3,\"b\",0))","v":0},{"$f":"SUM(Sheet3!D18:'Sheet3'!AQ18)","v":0}]
[null,null,null,{"$f":"IF('S-P表'!D19=1,1,IF('S-P表'!D19=3,\"b\",0))","v":0},{"$f":"IF('S-P表'!E19=1,1,IF('S-P表'!E19=3,\"b\",0))","v":0},{"$f":"IF('S-P表'!F19=1,1,IF('S-P表'!F19=3,\"b\",0))","v":0},{"$f":"IF('S-P表'!G19=1,1,IF('S-P表'!G19=3,\"b\",0))","v":0},{"$f":"IF('S-P表'!H19=1,1,IF('S-P表'!H19=3,\"b\",0))","v":0},{"$f":"IF('S-P表'!I19=1,1,IF('S-P表'!I19=3,\"b\",0))","v":0},{"$f":"IF('S-P表'!J19=1,1,IF('S-P表'!J19=3,\"b\",0))","v":0},{"$f":"IF('S-P表'!K19=1,1,IF('S-P表'!K19=3,\"b\",0))","v":0},{"$f":"IF('S-P表'!L19=1,1,IF('S-P表'!L19=3,\"b\",0))","v":0},{"$f":"IF('S-P表'!M19=1,1,IF('S-P表'!M19=3,\"b\",0))","v":0},{"$f":"IF('S-P表'!N19=1,1,IF('S-P表'!N19=3,\"b\",0))","v":0},{"$f":"IF('S-P表'!O19=1,1,IF('S-P表'!O19=3,\"b\",0))","v":0},{"$f":"IF('S-P表'!P19=1,1,IF('S-P表'!P19=3,\"b\",0))","v":0},{"$f":"IF('S-P表'!Q19=1,1,IF('S-P表'!Q19=3,\"b\",0))","v":0},{"$f":"IF('S-P表'!R19=1,1,IF('S-P表'!R19=3,\"b\",0))","v":0},{"$f":"IF('S-P表'!S19=1,1,IF('S-P表'!S19=3,\"b\",0))","v":0},{"$f":"IF('S-P表'!T19=1,1,IF('S-P表'!T19=3,\"b\",0))","v":0},{"$f":"IF('S-P表'!U19=1,1,IF('S-P表'!U19=3,\"b\",0))","v":0},{"$f":"IF('S-P表'!V19=1,1,IF('S-P表'!V19=3,\"b\",0))","v":0},{"$f":"IF('S-P表'!W19=1,1,IF('S-P表'!W19=3,\"b\",0))","v":0},{"$f":"IF('S-P表'!X19=1,1,IF('S-P表'!X19=3,\"b\",0))","v":0},{"$f":"IF('S-P表'!Y19=1,1,IF('S-P表'!Y19=3,\"b\",0))","v":0},{"$f":"IF('S-P表'!Z19=1,1,IF('S-P表'!Z19=3,\"b\",0))","v":0},{"$f":"IF('S-P表'!AA19=1,1,IF('S-P表'!AA19=3,\"b\",0))","v":0},{"$f":"IF('S-P表'!AB19=1,1,IF('S-P表'!AB19=3,\"b\",0))","v":0},{"$f":"IF('S-P表'!AC19=1,1,IF('S-P表'!AC19=3,\"b\",0))","v":0},{"$f":"IF('S-P表'!AD19=1,1,IF('S-P表'!AD19=3,\"b\",0))","v":0},{"$f":"IF('S-P表'!AE19=1,1,IF('S-P表'!AE19=3,\"b\",0))","v":0},{"$f":"IF('S-P表'!AF19=1,1,IF('S-P表'!AF19=3,\"b\",0))","v":0},{"$f":"IF('S-P表'!AG19=1,1,IF('S-P表'!AG19=3,\"b\",0))","v":0},{"$f":"IF('S-P表'!AH19=1,1,IF('S-P表'!AH19=3,\"b\",0))","v":0},{"$f":"IF('S-P表'!AI19=1,1,IF('S-P表'!AI19=3,\"b\",0))","v":0},{"$f":"IF('S-P表'!AJ19=1,1,IF('S-P表'!AJ19=3,\"b\",0))","v":0},{"$f":"IF('S-P表'!AK19=1,1,IF('S-P表'!AK19=3,\"b\",0))","v":0},{"$f":"IF('S-P表'!AL19=1,1,IF('S-P表'!AL19=3,\"b\",0))","v":0},{"$f":"IF('S-P表'!AM19=1,1,IF('S-P表'!AM19=3,\"b\",0))","v":0},{"$f":"IF('S-P表'!AN19=1,1,IF('S-P表'!AN19=3,\"b\",0))","v":0},{"$f":"IF('S-P表'!AO19=1,1,IF('S-P表'!AO19=3,\"b\",0))","v":0},{"$f":"IF('S-P表'!AP19=1,1,IF('S-P表'!AP19=3,\"b\",0))","v":0},{"$f":"IF('S-P表'!AQ19=1,1,IF('S-P表'!AQ19=3,\"b\",0))","v":0},{"$f":"SUM(Sheet3!D19:'Sheet3'!AQ19)","v":0}]
[null,null,null,{"$f":"IF('S-P表'!D20=1,1,IF('S-P表'!D20=3,\"b\",0))","v":0},{"$f":"IF('S-P表'!E20=1,1,IF('S-P表'!E20=3,\"b\",0))","v":0},{"$f":"IF('S-P表'!F20=1,1,IF('S-P表'!F20=3,\"b\",0))","v":0},{"$f":"IF('S-P表'!G20=1,1,IF('S-P表'!G20=3,\"b\",0))","v":0},{"$f":"IF('S-P表'!H20=1,1,IF('S-P表'!H20=3,\"b\",0))","v":0},{"$f":"IF('S-P表'!I20=1,1,IF('S-P表'!I20=3,\"b\",0))","v":0},{"$f":"IF('S-P表'!J20=1,1,IF('S-P表'!J20=3,\"b\",0))","v":0},{"$f":"IF('S-P表'!K20=1,1,IF('S-P表'!K20=3,\"b\",0))","v":0},{"$f":"IF('S-P表'!L20=1,1,IF('S-P表'!L20=3,\"b\",0))","v":0},{"$f":"IF('S-P表'!M20=1,1,IF('S-P表'!M20=3,\"b\",0))","v":0},{"$f":"IF('S-P表'!N20=1,1,IF('S-P表'!N20=3,\"b\",0))","v":0},{"$f":"IF('S-P表'!O20=1,1,IF('S-P表'!O20=3,\"b\",0))","v":0},{"$f":"IF('S-P表'!P20=1,1,IF('S-P表'!P20=3,\"b\",0))","v":0},{"$f":"IF('S-P表'!Q20=1,1,IF('S-P表'!Q20=3,\"b\",0))","v":0},{"$f":"IF('S-P表'!R20=1,1,IF('S-P表'!R20=3,\"b\",0))","v":0},{"$f":"IF('S-P表'!S20=1,1,IF('S-P表'!S20=3,\"b\",0))","v":0},{"$f":"IF('S-P表'!T20=1,1,IF('S-P表'!T20=3,\"b\",0))","v":0},{"$f":"IF('S-P表'!U20=1,1,IF('S-P表'!U20=3,\"b\",0))","v":0},{"$f":"IF('S-P表'!V20=1,1,IF('S-P表'!V20=3,\"b\",0))","v":0},{"$f":"IF('S-P表'!W20=1,1,IF('S-P表'!W20=3,\"b\",0))","v":0},{"$f":"IF('S-P表'!X20=1,1,IF('S-P表'!X20=3,\"b\",0))","v":0},{"$f":"IF('S-P表'!Y20=1,1,IF('S-P表'!Y20=3,\"b\",0))","v":0},{"$f":"IF('S-P表'!Z20=1,1,IF('S-P表'!Z20=3,\"b\",0))","v":0},{"$f":"IF('S-P表'!AA20=1,1,IF('S-P表'!AA20=3,\"b\",0))","v":0},{"$f":"IF('S-P表'!AB20=1,1,IF('S-P表'!AB20=3,\"b\",0))","v":0},{"$f":"IF('S-P表'!AC20=1,1,IF('S-P表'!AC20=3,\"b\",0))","v":0},{"$f":"IF('S-P表'!AD20=1,1,IF('S-P表'!AD20=3,\"b\",0))","v":0},{"$f":"IF('S-P表'!AE20=1,1,IF('S-P表'!AE20=3,\"b\",0))","v":0},{"$f":"IF('S-P表'!AF20=1,1,IF('S-P表'!AF20=3,\"b\",0))","v":0},{"$f":"IF('S-P表'!AG20=1,1,IF('S-P表'!AG20=3,\"b\",0))","v":0},{"$f":"IF('S-P表'!AH20=1,1,IF('S-P表'!AH20=3,\"b\",0))","v":0},{"$f":"IF('S-P表'!AI20=1,1,IF('S-P表'!AI20=3,\"b\",0))","v":0},{"$f":"IF('S-P表'!AJ20=1,1,IF('S-P表'!AJ20=3,\"b\",0))","v":0},{"$f":"IF('S-P表'!AK20=1,1,IF('S-P表'!AK20=3,\"b\",0))","v":0},{"$f":"IF('S-P表'!AL20=1,1,IF('S-P表'!AL20=3,\"b\",0))","v":0},{"$f":"IF('S-P表'!AM20=1,1,IF('S-P表'!AM20=3,\"b\",0))","v":0},{"$f":"IF('S-P表'!AN20=1,1,IF('S-P表'!AN20=3,\"b\",0))","v":0},{"$f":"IF('S-P表'!AO20=1,1,IF('S-P表'!AO20=3,\"b\",0))","v":0},{"$f":"IF('S-P表'!AP20=1,1,IF('S-P表'!AP20=3,\"b\",0))","v":0},{"$f":"IF('S-P表'!AQ20=1,1,IF('S-P表'!AQ20=3,\"b\",0))","v":0},{"$f":"SUM(Sheet3!D20:'Sheet3'!AQ20)","v":0}]
[null,null,null,{"$f":"IF('S-P表'!D21=1,1,IF('S-P表'!D21=3,\"b\",0))","v":0},{"$f":"IF('S-P表'!E21=1,1,IF('S-P表'!E21=3,\"b\",0))","v":0},{"$f":"IF('S-P表'!F21=1,1,IF('S-P表'!F21=3,\"b\",0))","v":0},{"$f":"IF('S-P表'!G21=1,1,IF('S-P表'!G21=3,\"b\",0))","v":0},{"$f":"IF('S-P表'!H21=1,1,IF('S-P表'!H21=3,\"b\",0))","v":0},{"$f":"IF('S-P表'!I21=1,1,IF('S-P表'!I21=3,\"b\",0))","v":0},{"$f":"IF('S-P表'!J21=1,1,IF('S-P表'!J21=3,\"b\",0))","v":0},{"$f":"IF('S-P表'!K21=1,1,IF('S-P表'!K21=3,\"b\",0))","v":0},{"$f":"IF('S-P表'!L21=1,1,IF('S-P表'!L21=3,\"b\",0))","v":0},{"$f":"IF('S-P表'!M21=1,1,IF('S-P表'!M21=3,\"b\",0))","v":0},{"$f":"IF('S-P表'!N21=1,1,IF('S-P表'!N21=3,\"b\",0))","v":0},{"$f":"IF('S-P表'!O21=1,1,IF('S-P表'!O21=3,\"b\",0))","v":0},{"$f":"IF('S-P表'!P21=1,1,IF('S-P表'!P21=3,\"b\",0))","v":0},{"$f":"IF('S-P表'!Q21=1,1,IF('S-P表'!Q21=3,\"b\",0))","v":0},{"$f":"IF('S-P表'!R21=1,1,IF('S-P表'!R21=3,\"b\",0))","v":0},{"$f":"IF('S-P表'!S21=1,1,IF('S-P表'!S21=3,\"b\",0))","v":0},{"$f":"IF('S-P表'!T21=1,1,IF('S-P表'!T21=3,\"b\",0))","v":0},{"$f":"IF('S-P表'!U21=1,1,IF('S-P表'!U21=3,\"b\",0))","v":0},{"$f":"IF('S-P表'!V21=1,1,IF('S-P表'!V21=3,\"b\",0))","v":0},{"$f":"IF('S-P表'!W21=1,1,IF('S-P表'!W21=3,\"b\",0))","v":0},{"$f":"IF('S-P表'!X21=1,1,IF('S-P表'!X21=3,\"b\",0))","v":0},{"$f":"IF('S-P表'!Y21=1,1,IF('S-P表'!Y21=3,\"b\",0))","v":0},{"$f":"IF('S-P表'!Z21=1,1,IF('S-P表'!Z21=3,\"b\",0))","v":0},{"$f":"IF('S-P表'!AA21=1,1,IF('S-P表'!AA21=3,\"b\",0))","v":0},{"$f":"IF('S-P表'!AB21=1,1,IF('S-P表'!AB21=3,\"b\",0))","v":0},{"$f":"IF('S-P表'!AC21=1,1,IF('S-P表'!AC21=3,\"b\",0))","v":0},{"$f":"IF('S-P表'!AD21=1,1,IF('S-P表'!AD21=3,\"b\",0))","v":0},{"$f":"IF('S-P表'!AE21=1,1,IF('S-P表'!AE21=3,\"b\",0))","v":0},{"$f":"IF('S-P表'!AF21=1,1,IF('S-P表'!AF21=3,\"b\",0))","v":0},{"$f":"IF('S-P表'!AG21=1,1,IF('S-P表'!AG21=3,\"b\",0))","v":0},{"$f":"IF('S-P表'!AH21=1,1,IF('S-P表'!AH21=3,\"b\",0))","v":0},{"$f":"IF('S-P表'!AI21=1,1,IF('S-P表'!AI21=3,\"b\",0))","v":0},{"$f":"IF('S-P表'!AJ21=1,1,IF('S-P表'!AJ21=3,\"b\",0))","v":0},{"$f":"IF('S-P表'!AK21=1,1,IF('S-P表'!AK21=3,\"b\",0))","v":0},{"$f":"IF('S-P表'!AL21=1,1,IF('S-P表'!AL21=3,\"b\",0))","v":0},{"$f":"IF('S-P表'!AM21=1,1,IF('S-P表'!AM21=3,\"b\",0))","v":0},{"$f":"IF('S-P表'!AN21=1,1,IF('S-P表'!AN21=3,\"b\",0))","v":0},{"$f":"IF('S-P表'!AO21=1,1,IF('S-P表'!AO21=3,\"b\",0))","v":0},{"$f":"IF('S-P表'!AP21=1,1,IF('S-P表'!AP21=3,\"b\",0))","v":0},{"$f":"IF('S-P表'!AQ21=1,1,IF('S-P表'!AQ21=3,\"b\",0))","v":0},{"$f":"SUM(Sheet3!D21:'Sheet3'!AQ21)","v":0}]
[null,null,null,{"$f":"IF('S-P表'!D22=1,1,IF('S-P表'!D22=3,\"b\",0))","v":0},{"$f":"IF('S-P表'!E22=1,1,IF('S-P表'!E22=3,\"b\",0))","v":0},{"$f":"IF('S-P表'!F22=1,1,IF('S-P表'!F22=3,\"b\",0))","v":0},{"$f":"IF('S-P表'!G22=1,1,IF('S-P表'!G22=3,\"b\",0))","v":0},{"$f":"IF('S-P表'!H22=1,1,IF('S-P表'!H22=3,\"b\",0))","v":0},{"$f":"IF('S-P表'!I22=1,1,IF('S-P表'!I22=3,\"b\",0))","v":0},{"$f":"IF('S-P表'!J22=1,1,IF('S-P表'!J22=3,\"b\",0))","v":0},{"$f":"IF('S-P表'!K22=1,1,IF('S-P表'!K22=3,\"b\",0))","v":0},{"$f":"IF('S-P表'!L22=1,1,IF('S-P表'!L22=3,\"b\",0))","v":0},{"$f":"IF('S-P表'!M22=1,1,IF('S-P表'!M22=3,\"b\",0))","v":0},{"$f":"IF('S-P表'!N22=1,1,IF('S-P表'!N22=3,\"b\",0))","v":0},{"$f":"IF('S-P表'!O22=1,1,IF('S-P表'!O22=3,\"b\",0))","v":0},{"$f":"IF('S-P表'!P22=1,1,IF('S-P表'!P22=3,\"b\",0))","v":0},{"$f":"IF('S-P表'!Q22=1,1,IF('S-P表'!Q22=3,\"b\",0))","v":0},{"$f":"IF('S-P表'!R22=1,1,IF('S-P表'!R22=3,\"b\",0))","v":0},{"$f":"IF('S-P表'!S22=1,1,IF('S-P表'!S22=3,\"b\",0))","v":0},{"$f":"IF('S-P表'!T22=1,1,IF('S-P表'!T22=3,\"b\",0))","v":0},{"$f":"IF('S-P表'!U22=1,1,IF('S-P表'!U22=3,\"b\",0))","v":0},{"$f":"IF('S-P表'!V22=1,1,IF('S-P表'!V22=3,\"b\",0))","v":0},{"$f":"IF('S-P表'!W22=1,1,IF('S-P表'!W22=3,\"b\",0))","v":0},{"$f":"IF('S-P表'!X22=1,1,IF('S-P表'!X22=3,\"b\",0))","v":0},{"$f":"IF('S-P表'!Y22=1,1,IF('S-P表'!Y22=3,\"b\",0))","v":0},{"$f":"IF('S-P表'!Z22=1,1,IF('S-P表'!Z22=3,\"b\",0))","v":0},{"$f":"IF('S-P表'!AA22=1,1,IF('S-P表'!AA22=3,\"b\",0))","v":0},{"$f":"IF('S-P表'!AB22=1,1,IF('S-P表'!AB22=3,\"b\",0))","v":0},{"$f":"IF('S-P表'!AC22=1,1,IF('S-P表'!AC22=3,\"b\",0))","v":0},{"$f":"IF('S-P表'!AD22=1,1,IF('S-P表'!AD22=3,\"b\",0))","v":0},{"$f":"IF('S-P表'!AE22=1,1,IF('S-P表'!AE22=3,\"b\",0))","v":0},{"$f":"IF('S-P表'!AF22=1,1,IF('S-P表'!AF22=3,\"b\",0))","v":0},{"$f":"IF('S-P表'!AG22=1,1,IF('S-P表'!AG22=3,\"b\",0))","v":0},{"$f":"IF('S-P表'!AH22=1,1,IF('S-P表'!AH22=3,\"b\",0))","v":0},{"$f":"IF('S-P表'!AI22=1,1,IF('S-P表'!AI22=3,\"b\",0))","v":0},{"$f":"IF('S-P表'!AJ22=1,1,IF('S-P表'!AJ22=3,\"b\",0))","v":0},{"$f":"IF('S-P表'!AK22=1,1,IF('S-P表'!AK22=3,\"b\",0))","v":0},{"$f":"IF('S-P表'!AL22=1,1,IF('S-P表'!AL22=3,\"b\",0))","v":0},{"$f":"IF('S-P表'!AM22=1,1,IF('S-P表'!AM22=3,\"b\",0))","v":0},{"$f":"IF('S-P表'!AN22=1,1,IF('S-P表'!AN22=3,\"b\",0))","v":0},{"$f":"IF('S-P表'!AO22=1,1,IF('S-P表'!AO22=3,\"b\",0))","v":0},{"$f":"IF('S-P表'!AP22=1,1,IF('S-P表'!AP22=3,\"b\",0))","v":0},{"$f":"IF('S-P表'!AQ22=1,1,IF('S-P表'!AQ22=3,\"b\",0))","v":0},{"$f":"SUM(Sheet3!D22:'Sheet3'!AQ22)","v":0}]
[null,null,null,{"$f":"IF('S-P表'!D23=1,1,IF('S-P表'!D23=3,\"b\",0))","v":0},{"$f":"IF('S-P表'!E23=1,1,IF('S-P表'!E23=3,\"b\",0))","v":0},{"$f":"IF('S-P表'!F23=1,1,IF('S-P表'!F23=3,\"b\",0))","v":0},{"$f":"IF('S-P表'!G23=1,1,IF('S-P表'!G23=3,\"b\",0))","v":0},{"$f":"IF('S-P表'!H23=1,1,IF('S-P表'!H23=3,\"b\",0))","v":0},{"$f":"IF('S-P表'!I23=1,1,IF('S-P表'!I23=3,\"b\",0))","v":0},{"$f":"IF('S-P表'!J23=1,1,IF('S-P表'!J23=3,\"b\",0))","v":0},{"$f":"IF('S-P表'!K23=1,1,IF('S-P表'!K23=3,\"b\",0))","v":0},{"$f":"IF('S-P表'!L23=1,1,IF('S-P表'!L23=3,\"b\",0))","v":0},{"$f":"IF('S-P表'!M23=1,1,IF('S-P表'!M23=3,\"b\",0))","v":0},{"$f":"IF('S-P表'!N23=1,1,IF('S-P表'!N23=3,\"b\",0))","v":0},{"$f":"IF('S-P表'!O23=1,1,IF('S-P表'!O23=3,\"b\",0))","v":0},{"$f":"IF('S-P表'!P23=1,1,IF('S-P表'!P23=3,\"b\",0))","v":0},{"$f":"IF('S-P表'!Q23=1,1,IF('S-P表'!Q23=3,\"b\",0))","v":0},{"$f":"IF('S-P表'!R23=1,1,IF('S-P表'!R23=3,\"b\",0))","v":0},{"$f":"IF('S-P表'!S23=1,1,IF('S-P表'!S23=3,\"b\",0))","v":0},{"$f":"IF('S-P表'!T23=1,1,IF('S-P表'!T23=3,\"b\",0))","v":0},{"$f":"IF('S-P表'!U23=1,1,IF('S-P表'!U23=3,\"b\",0))","v":0},{"$f":"IF('S-P表'!V23=1,1,IF('S-P表'!V23=3,\"b\",0))","v":0},{"$f":"IF('S-P表'!W23=1,1,IF('S-P表'!W23=3,\"b\",0))","v":0},{"$f":"IF('S-P表'!X23=1,1,IF('S-P表'!X23=3,\"b\",0))","v":0},{"$f":"IF('S-P表'!Y23=1,1,IF('S-P表'!Y23=3,\"b\",0))","v":0},{"$f":"IF('S-P表'!Z23=1,1,IF('S-P表'!Z23=3,\"b\",0))","v":0},{"$f":"IF('S-P表'!AA23=1,1,IF('S-P表'!AA23=3,\"b\",0))","v":0},{"$f":"IF('S-P表'!AB23=1,1,IF('S-P表'!AB23=3,\"b\",0))","v":0},{"$f":"IF('S-P表'!AC23=1,1,IF('S-P表'!AC23=3,\"b\",0))","v":0},{"$f":"IF('S-P表'!AD23=1,1,IF('S-P表'!AD23=3,\"b\",0))","v":0},{"$f":"IF('S-P表'!AE23=1,1,IF('S-P表'!AE23=3,\"b\",0))","v":0},{"$f":"IF('S-P表'!AF23=1,1,IF('S-P表'!AF23=3,\"b\",0))","v":0},{"$f":"IF('S-P表'!AG23=1,1,IF('S-P表'!AG23=3,\"b\",0))","v":0},{"$f":"IF('S-P表'!AH23=1,1,IF('S-P表'!AH23=3,\"b\",0))","v":0},{"$f":"IF('S-P表'!AI23=1,1,IF('S-P表'!AI23=3,\"b\",0))","v":0},{"$f":"IF('S-P表'!AJ23=1,1,IF('S-P表'!AJ23=3,\"b\",0))","v":0},{"$f":"IF('S-P表'!AK23=1,1,IF('S-P表'!AK23=3,\"b\",0))","v":0},{"$f":"IF('S-P表'!AL23=1,1,IF('S-P表'!AL23=3,\"b\",0))","v":0},{"$f":"IF('S-P表'!AM23=1,1,IF('S-P表'!AM23=3,\"b\",0))","v":0},{"$f":"IF('S-P表'!AN23=1,1,IF('S-P表'!AN23=3,\"b\",0))","v":0},{"$f":"IF('S-P表'!AO23=1,1,IF('S-P表'!AO23=3,\"b\",0))","v":0},{"$f":"IF('S-P表'!AP23=1,1,IF('S-P表'!AP23=3,\"b\",0))","v":0},{"$f":"IF('S-P表'!AQ23=1,1,IF('S-P表'!AQ23=3,\"b\",0))","v":0},{"$f":"SUM(Sheet3!D23:'Sheet3'!AQ23)","v":0}]
[null,null,null,{"$f":"IF('S-P表'!D24=1,1,IF('S-P表'!D24=3,\"b\",0))","v":0},{"$f":"IF('S-P表'!E24=1,1,IF('S-P表'!E24=3,\"b\",0))","v":0},{"$f":"IF('S-P表'!F24=1,1,IF('S-P表'!F24=3,\"b\",0))","v":0},{"$f":"IF('S-P表'!G24=1,1,IF('S-P表'!G24=3,\"b\",0))","v":0},{"$f":"IF('S-P表'!H24=1,1,IF('S-P表'!H24=3,\"b\",0))","v":0},{"$f":"IF('S-P表'!I24=1,1,IF('S-P表'!I24=3,\"b\",0))","v":0},{"$f":"IF('S-P表'!J24=1,1,IF('S-P表'!J24=3,\"b\",0))","v":0},{"$f":"IF('S-P表'!K24=1,1,IF('S-P表'!K24=3,\"b\",0))","v":0},{"$f":"IF('S-P表'!L24=1,1,IF('S-P表'!L24=3,\"b\",0))","v":0},{"$f":"IF('S-P表'!M24=1,1,IF('S-P表'!M24=3,\"b\",0))","v":0},{"$f":"IF('S-P表'!N24=1,1,IF('S-P表'!N24=3,\"b\",0))","v":0},{"$f":"IF('S-P表'!O24=1,1,IF('S-P表'!O24=3,\"b\",0))","v":0},{"$f":"IF('S-P表'!P24=1,1,IF('S-P表'!P24=3,\"b\",0))","v":0},{"$f":"IF('S-P表'!Q24=1,1,IF('S-P表'!Q24=3,\"b\",0))","v":0},{"$f":"IF('S-P表'!R24=1,1,IF('S-P表'!R24=3,\"b\",0))","v":0},{"$f":"IF('S-P表'!S24=1,1,IF('S-P表'!S24=3,\"b\",0))","v":0},{"$f":"IF('S-P表'!T24=1,1,IF('S-P表'!T24=3,\"b\",0))","v":0},{"$f":"IF('S-P表'!U24=1,1,IF('S-P表'!U24=3,\"b\",0))","v":0},{"$f":"IF('S-P表'!V24=1,1,IF('S-P表'!V24=3,\"b\",0))","v":0},{"$f":"IF('S-P表'!W24=1,1,IF('S-P表'!W24=3,\"b\",0))","v":0},{"$f":"IF('S-P表'!X24=1,1,IF('S-P表'!X24=3,\"b\",0))","v":0},{"$f":"IF('S-P表'!Y24=1,1,IF('S-P表'!Y24=3,\"b\",0))","v":0},{"$f":"IF('S-P表'!Z24=1,1,IF('S-P表'!Z24=3,\"b\",0))","v":0},{"$f":"IF('S-P表'!AA24=1,1,IF('S-P表'!AA24=3,\"b\",0))","v":0},{"$f":"IF('S-P表'!AB24=1,1,IF('S-P表'!AB24=3,\"b\",0))","v":0},{"$f":"IF('S-P表'!AC24=1,1,IF('S-P表'!AC24=3,\"b\",0))","v":0},{"$f":"IF('S-P表'!AD24=1,1,IF('S-P表'!AD24=3,\"b\",0))","v":0},{"$f":"IF('S-P表'!AE24=1,1,IF('S-P表'!AE24=3,\"b\",0))","v":0},{"$f":"IF('S-P表'!AF24=1,1,IF('S-P表'!AF24=3,\"b\",0))","v":0},{"$f":"IF('S-P表'!AG24=1,1,IF('S-P表'!AG24=3,\"b\",0))","v":0},{"$f":"IF('S-P表'!AH24=1,1,IF('S-P表'!AH24=3,\"b\",0))","v":0},{"$f":"IF('S-P表'!AI24=1,1,IF('S-P表'!AI24=3,\"b\",0))","v":0},{"$f":"IF('S-P表'!AJ24=1,1,IF('S-P表'!AJ24=3,\"b\",0))","v":0},{"$f":"IF('S-P表'!AK24=1,1,IF('S-P表'!AK24=3,\"b\",0))","v":0},{"$f":"IF('S-P表'!AL24=1,1,IF('S-P表'!AL24=3,\"b\",0))","v":0},{"$f":"IF('S-P表'!AM24=1,1,IF('S-P表'!AM24=3,\"b\",0))","v":0},{"$f":"IF('S-P表'!AN24=1,1,IF('S-P表'!AN24=3,\"b\",0))","v":0},{"$f":"IF('S-P表'!AO24=1,1,IF('S-P表'!AO24=3,\"b\",0))","v":0},{"$f":"IF('S-P表'!AP24=1,1,IF('S-P表'!AP24=3,\"b\",0))","v":0},{"$f":"IF('S-P表'!AQ24=1,1,IF('S-P表'!AQ24=3,\"b\",0))","v":0},{"$f":"SUM(Sheet3!D24:'Sheet3'!AQ24)","v":0}]
[null,null,null,{"$f":"IF('S-P表'!D25=1,1,IF('S-P表'!D25=3,\"b\",0))","v":0},{"$f":"IF('S-P表'!E25=1,1,IF('S-P表'!E25=3,\"b\",0))","v":0},{"$f":"IF('S-P表'!F25=1,1,IF('S-P表'!F25=3,\"b\",0))","v":0},{"$f":"IF('S-P表'!G25=1,1,IF('S-P表'!G25=3,\"b\",0))","v":0},{"$f":"IF('S-P表'!H25=1,1,IF('S-P表'!H25=3,\"b\",0))","v":0},{"$f":"IF('S-P表'!I25=1,1,IF('S-P表'!I25=3,\"b\",0))","v":0},{"$f":"IF('S-P表'!J25=1,1,IF('S-P表'!J25=3,\"b\",0))","v":0},{"$f":"IF('S-P表'!K25=1,1,IF('S-P表'!K25=3,\"b\",0))","v":0},{"$f":"IF('S-P表'!L25=1,1,IF('S-P表'!L25=3,\"b\",0))","v":0},{"$f":"IF('S-P表'!M25=1,1,IF('S-P表'!M25=3,\"b\",0))","v":0},{"$f":"IF('S-P表'!N25=1,1,IF('S-P表'!N25=3,\"b\",0))","v":0},{"$f":"IF('S-P表'!O25=1,1,IF('S-P表'!O25=3,\"b\",0))","v":0},{"$f":"IF('S-P表'!P25=1,1,IF('S-P表'!P25=3,\"b\",0))","v":0},{"$f":"IF('S-P表'!Q25=1,1,IF('S-P表'!Q25=3,\"b\",0))","v":0},{"$f":"IF('S-P表'!R25=1,1,IF('S-P表'!R25=3,\"b\",0))","v":0},{"$f":"IF('S-P表'!S25=1,1,IF('S-P表'!S25=3,\"b\",0))","v":0},{"$f":"IF('S-P表'!T25=1,1,IF('S-P表'!T25=3,\"b\",0))","v":0},{"$f":"IF('S-P表'!U25=1,1,IF('S-P表'!U25=3,\"b\",0))","v":0},{"$f":"IF('S-P表'!V25=1,1,IF('S-P表'!V25=3,\"b\",0))","v":0},{"$f":"IF('S-P表'!W25=1,1,IF('S-P表'!W25=3,\"b\",0))","v":0},{"$f":"IF('S-P表'!X25=1,1,IF('S-P表'!X25=3,\"b\",0))","v":0},{"$f":"IF('S-P表'!Y25=1,1,IF('S-P表'!Y25=3,\"b\",0))","v":0},{"$f":"IF('S-P表'!Z25=1,1,IF('S-P表'!Z25=3,\"b\",0))","v":0},{"$f":"IF('S-P表'!AA25=1,1,IF('S-P表'!AA25=3,\"b\",0))","v":0},{"$f":"IF('S-P表'!AB25=1,1,IF('S-P表'!AB25=3,\"b\",0))","v":0},{"$f":"IF('S-P表'!AC25=1,1,IF('S-P表'!AC25=3,\"b\",0))","v":0},{"$f":"IF('S-P表'!AD25=1,1,IF('S-P表'!AD25=3,\"b\",0))","v":0},{"$f":"IF('S-P表'!AE25=1,1,IF('S-P表'!AE25=3,\"b\",0))","v":0},{"$f":"IF('S-P表'!AF25=1,1,IF('S-P表'!AF25=3,\"b\",0))","v":0},{"$f":"IF('S-P表'!AG25=1,1,IF('S-P表'!AG25=3,\"b\",0))","v":0},{"$f":"IF('S-P表'!AH25=1,1,IF('S-P表'!AH25=3,\"b\",0))","v":0},{"$f":"IF('S-P表'!AI25=1,1,IF('S-P表'!AI25=3,\"b\",0))","v":0},{"$f":"IF('S-P表'!AJ25=1,1,IF('S-P表'!AJ25=3,\"b\",0))","v":0},{"$f":"IF('S-P表'!AK25=1,1,IF('S-P表'!AK25=3,\"b\",0))","v":0},{"$f":"IF('S-P表'!AL25=1,1,IF('S-P表'!AL25=3,\"b\",0))","v":0},{"$f":"IF('S-P表'!AM25=1,1,IF('S-P表'!AM25=3,\"b\",0))","v":0},{"$f":"IF('S-P表'!AN25=1,1,IF('S-P表'!AN25=3,\"b\",0))","v":0},{"$f":"IF('S-P表'!AO25=1,1,IF('S-P表'!AO25=3,\"b\",0))","v":0},{"$f":"IF('S-P表'!AP25=1,1,IF('S-P表'!AP25=3,\"b\",0))","v":0},{"$f":"IF('S-P表'!AQ25=1,1,IF('S-P表'!AQ25=3,\"b\",0))","v":0},{"$f":"SUM(Sheet3!D25:'Sheet3'!AQ25)","v":0}]
[null,null,null,{"$f":"IF('S-P表'!D26=1,1,IF('S-P表'!D26=3,\"b\",0))","v":0},{"$f":"IF('S-P表'!E26=1,1,IF('S-P表'!E26=3,\"b\",0))","v":0},{"$f":"IF('S-P表'!F26=1,1,IF('S-P表'!F26=3,\"b\",0))","v":0},{"$f":"IF('S-P表'!G26=1,1,IF('S-P表'!G26=3,\"b\",0))","v":0},{"$f":"IF('S-P表'!H26=1,1,IF('S-P表'!H26=3,\"b\",0))","v":0},{"$f":"IF('S-P表'!I26=1,1,IF('S-P表'!I26=3,\"b\",0))","v":0},{"$f":"IF('S-P表'!J26=1,1,IF('S-P表'!J26=3,\"b\",0))","v":0},{"$f":"IF('S-P表'!K26=1,1,IF('S-P表'!K26=3,\"b\",0))","v":0},{"$f":"IF('S-P表'!L26=1,1,IF('S-P表'!L26=3,\"b\",0))","v":0},{"$f":"IF('S-P表'!M26=1,1,IF('S-P表'!M26=3,\"b\",0))","v":0},{"$f":"IF('S-P表'!N26=1,1,IF('S-P表'!N26=3,\"b\",0))","v":0},{"$f":"IF('S-P表'!O26=1,1,IF('S-P表'!O26=3,\"b\",0))","v":0},{"$f":"IF('S-P表'!P26=1,1,IF('S-P表'!P26=3,\"b\",0))","v":0},{"$f":"IF('S-P表'!Q26=1,1,IF('S-P表'!Q26=3,\"b\",0))","v":0},{"$f":"IF('S-P表'!R26=1,1,IF('S-P表'!R26=3,\"b\",0))","v":0},{"$f":"IF('S-P表'!S26=1,1,IF('S-P表'!S26=3,\"b\",0))","v":0},{"$f":"IF('S-P表'!T26=1,1,IF('S-P表'!T26=3,\"b\",0))","v":0},{"$f":"IF('S-P表'!U26=1,1,IF('S-P表'!U26=3,\"b\",0))","v":0},{"$f":"IF('S-P表'!V26=1,1,IF('S-P表'!V26=3,\"b\",0))","v":0},{"$f":"IF('S-P表'!W26=1,1,IF('S-P表'!W26=3,\"b\",0))","v":0},{"$f":"IF('S-P表'!X26=1,1,IF('S-P表'!X26=3,\"b\",0))","v":0},{"$f":"IF('S-P表'!Y26=1,1,IF('S-P表'!Y26=3,\"b\",0))","v":0},{"$f":"IF('S-P表'!Z26=1,1,IF('S-P表'!Z26=3,\"b\",0))","v":0},{"$f":"IF('S-P表'!AA26=1,1,IF('S-P表'!AA26=3,\"b\",0))","v":0},{"$f":"IF('S-P表'!AB26=1,1,IF('S-P表'!AB26=3,\"b\",0))","v":0},{"$f":"IF('S-P表'!AC26=1,1,IF('S-P表'!AC26=3,\"b\",0))","v":0},{"$f":"IF('S-P表'!AD26=1,1,IF('S-P表'!AD26=3,\"b\",0))","v":0},{"$f":"IF('S-P表'!AE26=1,1,IF('S-P表'!AE26=3,\"b\",0))","v":0},{"$f":"IF('S-P表'!AF26=1,1,IF('S-P表'!AF26=3,\"b\",0))","v":0},{"$f":"IF('S-P表'!AG26=1,1,IF('S-P表'!AG26=3,\"b\",0))","v":0},{"$f":"IF('S-P表'!AH26=1,1,IF('S-P表'!AH26=3,\"b\",0))","v":0},{"$f":"IF('S-P表'!AI26=1,1,IF('S-P表'!AI26=3,\"b\",0))","v":0},{"$f":"IF('S-P表'!AJ26=1,1,IF('S-P表'!AJ26=3,\"b\",0))","v":0},{"$f":"IF('S-P表'!AK26=1,1,IF('S-P表'!AK26=3,\"b\",0))","v":0},{"$f":"IF('S-P表'!AL26=1,1,IF('S-P表'!AL26=3,\"b\",0))","v":0},{"$f":"IF('S-P表'!AM26=1,1,IF('S-P表'!AM26=3,\"b\",0))","v":0},{"$f":"IF('S-P表'!AN26=1,1,IF('S-P表'!AN26=3,\"b\",0))","v":0},{"$f":"IF('S-P表'!AO26=1,1,IF('S-P表'!AO26=3,\"b\",0))","v":0},{"$f":"IF('S-P表'!AP26=1,1,IF('S-P表'!AP26=3,\"b\",0))","v":0},{"$f":"IF('S-P表'!AQ26=1,1,IF('S-P表'!AQ26=3,\"b\",0))","v":0},{"$f":"SUM(Sheet3!D26:'Sheet3'!AQ26)","v":0}]
[null,null,null,{"$f":"IF('S-P表'!D27=1,1,IF('S-P表'!D27=3,\"b\",0))","v":0},{"$f":"IF('S-P表'!E27=1,1,IF('S-P表'!E27=3,\"b\",0))","v":0},{"$f":"IF('S-P表'!F27=1,1,IF('S-P表'!F27=3,\"b\",0))","v":0},{"$f":"IF('S-P表'!G27=1,1,IF('S-P表'!G27=3,\"b\",0))","v":0},{"$f":"IF('S-P表'!H27=1,1,IF('S-P表'!H27=3,\"b\",0))","v":0},{"$f":"IF('S-P表'!I27=1,1,IF('S-P表'!I27=3,\"b\",0))","v":0},{"$f":"IF('S-P表'!J27=1,1,IF('S-P表'!J27=3,\"b\",0))","v":0},{"$f":"IF('S-P表'!K27=1,1,IF('S-P表'!K27=3,\"b\",0))","v":0},{"$f":"IF('S-P表'!L27=1,1,IF('S-P表'!L27=3,\"b\",0))","v":0},{"$f":"IF('S-P表'!M27=1,1,IF('S-P表'!M27=3,\"b\",0))","v":0},{"$f":"IF('S-P表'!N27=1,1,IF('S-P表'!N27=3,\"b\",0))","v":0},{"$f":"IF('S-P表'!O27=1,1,IF('S-P表'!O27=3,\"b\",0))","v":0},{"$f":"IF('S-P表'!P27=1,1,IF('S-P表'!P27=3,\"b\",0))","v":0},{"$f":"IF('S-P表'!Q27=1,1,IF('S-P表'!Q27=3,\"b\",0))","v":0},{"$f":"IF('S-P表'!R27=1,1,IF('S-P表'!R27=3,\"b\",0))","v":0},{"$f":"IF('S-P表'!S27=1,1,IF('S-P表'!S27=3,\"b\",0))","v":0},{"$f":"IF('S-P表'!T27=1,1,IF('S-P表'!T27=3,\"b\",0))","v":0},{"$f":"IF('S-P表'!U27=1,1,IF('S-P表'!U27=3,\"b\",0))","v":0},{"$f":"IF('S-P表'!V27=1,1,IF('S-P表'!V27=3,\"b\",0))","v":0},{"$f":"IF('S-P表'!W27=1,1,IF('S-P表'!W27=3,\"b\",0))","v":0},{"$f":"IF('S-P表'!X27=1,1,IF('S-P表'!X27=3,\"b\",0))","v":0},{"$f":"IF('S-P表'!Y27=1,1,IF('S-P表'!Y27=3,\"b\",0))","v":0},{"$f":"IF('S-P表'!Z27=1,1,IF('S-P表'!Z27=3,\"b\",0))","v":0},{"$f":"IF('S-P表'!AA27=1,1,IF('S-P表'!AA27=3,\"b\",0))","v":0},{"$f":"IF('S-P表'!AB27=1,1,IF('S-P表'!AB27=3,\"b\",0))","v":0},{"$f":"IF('S-P表'!AC27=1,1,IF('S-P表'!AC27=3,\"b\",0))","v":0},{"$f":"IF('S-P表'!AD27=1,1,IF('S-P表'!AD27=3,\"b\",0))","v":0},{"$f":"IF('S-P表'!AE27=1,1,IF('S-P表'!AE27=3,\"b\",0))","v":0},{"$f":"IF('S-P表'!AF27=1,1,IF('S-P表'!AF27=3,\"b\",0))","v":0},{"$f":"IF('S-P表'!AG27=1,1,IF('S-P表'!AG27=3,\"b\",0))","v":0},{"$f":"IF('S-P表'!AH27=1,1,IF('S-P表'!AH27=3,\"b\",0))","v":0},{"$f":"IF('S-P表'!AI27=1,1,IF('S-P表'!AI27=3,\"b\",0))","v":0},{"$f":"IF('S-P表'!AJ27=1,1,IF('S-P表'!AJ27=3,\"b\",0))","v":0},{"$f":"IF('S-P表'!AK27=1,1,IF('S-P表'!AK27=3,\"b\",0))","v":0},{"$f":"IF('S-P表'!AL27=1,1,IF('S-P表'!AL27=3,\"b\",0))","v":0},{"$f":"IF('S-P表'!AM27=1,1,IF('S-P表'!AM27=3,\"b\",0))","v":0},{"$f":"IF('S-P表'!AN27=1,1,IF('S-P表'!AN27=3,\"b\",0))","v":0},{"$f":"IF('S-P表'!AO27=1,1,IF('S-P表'!AO27=3,\"b\",0))","v":0},{"$f":"IF('S-P表'!AP27=1,1,IF('S-P表'!AP27=3,\"b\",0))","v":0},{"$f":"IF('S-P表'!AQ27=1,1,IF('S-P表'!AQ27=3,\"b\",0))","v":0},{"$f":"SUM(Sheet3!D27:'Sheet3'!AQ27)","v":0}]
[null,null,null,{"$f":"IF('S-P表'!D28=1,1,IF('S-P表'!D28=3,\"b\",0))","v":0},{"$f":"IF('S-P表'!E28=1,1,IF('S-P表'!E28=3,\"b\",0))","v":0},{"$f":"IF('S-P表'!F28=1,1,IF('S-P表'!F28=3,\"b\",0))","v":0},{"$f":"IF('S-P表'!G28=1,1,IF('S-P表'!G28=3,\"b\",0))","v":0},{"$f":"IF('S-P表'!H28=1,1,IF('S-P表'!H28=3,\"b\",0))","v":0},{"$f":"IF('S-P表'!I28=1,1,IF('S-P表'!I28=3,\"b\",0))","v":0},{"$f":"IF('S-P表'!J28=1,1,IF('S-P表'!J28=3,\"b\",0))","v":0},{"$f":"IF('S-P表'!K28=1,1,IF('S-P表'!K28=3,\"b\",0))","v":0},{"$f":"IF('S-P表'!L28=1,1,IF('S-P表'!L28=3,\"b\",0))","v":0},{"$f":"IF('S-P表'!M28=1,1,IF('S-P表'!M28=3,\"b\",0))","v":0},{"$f":"IF('S-P表'!N28=1,1,IF('S-P表'!N28=3,\"b\",0))","v":0},{"$f":"IF('S-P表'!O28=1,1,IF('S-P表'!O28=3,\"b\",0))","v":0},{"$f":"IF('S-P表'!P28=1,1,IF('S-P表'!P28=3,\"b\",0))","v":0},{"$f":"IF('S-P表'!Q28=1,1,IF('S-P表'!Q28=3,\"b\",0))","v":0},{"$f":"IF('S-P表'!R28=1,1,IF('S-P表'!R28=3,\"b\",0))","v":0},{"$f":"IF('S-P表'!S28=1,1,IF('S-P表'!S28=3,\"b\",0))","v":0},{"$f":"IF('S-P表'!T28=1,1,IF('S-P表'!T28=3,\"b\",0))","v":0},{"$f":"IF('S-P表'!U28=1,1,IF('S-P表'!U28=3,\"b\",0))","v":0},{"$f":"IF('S-P表'!V28=1,1,IF('S-P表'!V28=3,\"b\",0))","v":0},{"$f":"IF('S-P表'!W28=1,1,IF('S-P表'!W28=3,\"b\",0))","v":0},{"$f":"IF('S-P表'!X28=1,1,IF('S-P表'!X28=3,\"b\",0))","v":0},{"$f":"IF('S-P表'!Y28=1,1,IF('S-P表'!Y28=3,\"b\",0))","v":0},{"$f":"IF('S-P表'!Z28=1,1,IF('S-P表'!Z28=3,\"b\",0))","v":0},{"$f":"IF('S-P表'!AA28=1,1,IF('S-P表'!AA28=3,\"b\",0))","v":0},{"$f":"IF('S-P表'!AB28=1,1,IF('S-P表'!AB28=3,\"b\",0))","v":0},{"$f":"IF('S-P表'!AC28=1,1,IF('S-P表'!AC28=3,\"b\",0))","v":0},{"$f":"IF('S-P表'!AD28=1,1,IF('S-P表'!AD28=3,\"b\",0))","v":0},{"$f":"IF('S-P表'!AE28=1,1,IF('S-P表'!AE28=3,\"b\",0))","v":0},{"$f":"IF('S-P表'!AF28=1,1,IF('S-P表'!AF28=3,\"b\",0))","v":0},{"$f":"IF('S-P表'!AG28=1,1,IF('S-P表'!AG28=3,\"b\",0))","v":0},{"$f":"IF('S-P表'!AH28=1,1,IF('S-P表'!AH28=3,\"b\",0))","v":0},{"$f":"IF('S-P表'!AI28=1,1,IF('S-P表'!AI28=3,\"b\",0))","v":0},{"$f":"IF('S-P表'!AJ28=1,1,IF('S-P表'!AJ28=3,\"b\",0))","v":0},{"$f":"IF('S-P表'!AK28=1,1,IF('S-P表'!AK28=3,\"b\",0))","v":0},{"$f":"IF('S-P表'!AL28=1,1,IF('S-P表'!AL28=3,\"b\",0))","v":0},{"$f":"IF('S-P表'!AM28=1,1,IF('S-P表'!AM28=3,\"b\",0))","v":0},{"$f":"IF('S-P表'!AN28=1,1,IF('S-P表'!AN28=3,\"b\",0))","v":0},{"$f":"IF('S-P表'!AO28=1,1,IF('S-P表'!AO28=3,\"b\",0))","v":0},{"$f":"IF('S-P表'!AP28=1,1,IF('S-P表'!AP28=3,\"b\",0))","v":0},{"$f":"IF('S-P表'!AQ28=1,1,IF('S-P表'!AQ28=3,\"b\",0))","v":0},{"$f":"SUM(Sheet3!D28:'Sheet3'!AQ28)","v":0}]
[null,null,null,{"$f":"IF('S-P表'!D29=1,1,IF('S-P表'!D29=3,\"b\",0))","v":0},{"$f":"IF('S-P表'!E29=1,1,IF('S-P表'!E29=3,\"b\",0))","v":0},{"$f":"IF('S-P表'!F29=1,1,IF('S-P表'!F29=3,\"b\",0))","v":0},{"$f":"IF('S-P表'!G29=1,1,IF('S-P表'!G29=3,\"b\",0))","v":0},{"$f":"IF('S-P表'!H29=1,1,IF('S-P表'!H29=3,\"b\",0))","v":0},{"$f":"IF('S-P表'!I29=1,1,IF('S-P表'!I29=3,\"b\",0))","v":0},{"$f":"IF('S-P表'!J29=1,1,IF('S-P表'!J29=3,\"b\",0))","v":0},{"$f":"IF('S-P表'!K29=1,1,IF('S-P表'!K29=3,\"b\",0))","v":0},{"$f":"IF('S-P表'!L29=1,1,IF('S-P表'!L29=3,\"b\",0))","v":0},{"$f":"IF('S-P表'!M29=1,1,IF('S-P表'!M29=3,\"b\",0))","v":0},{"$f":"IF('S-P表'!N29=1,1,IF('S-P表'!N29=3,\"b\",0))","v":0},{"$f":"IF('S-P表'!O29=1,1,IF('S-P表'!O29=3,\"b\",0))","v":0},{"$f":"IF('S-P表'!P29=1,1,IF('S-P表'!P29=3,\"b\",0))","v":0},{"$f":"IF('S-P表'!Q29=1,1,IF('S-P表'!Q29=3,\"b\",0))","v":0},{"$f":"IF('S-P表'!R29=1,1,IF('S-P表'!R29=3,\"b\",0))","v":0},{"$f":"IF('S-P表'!S29=1,1,IF('S-P表'!S29=3,\"b\",0))","v":0},{"$f":"IF('S-P表'!T29=1,1,IF('S-P表'!T29=3,\"b\",0))","v":0},{"$f":"IF('S-P表'!U29=1,1,IF('S-P表'!U29=3,\"b\",0))","v":0},{"$f":"IF('S-P表'!V29=1,1,IF('S-P表'!V29=3,\"b\",0))","v":0},{"$f":"IF('S-P表'!W29=1,1,IF('S-P表'!W29=3,\"b\",0))","v":0},{"$f":"IF('S-P表'!X29=1,1,IF('S-P表'!X29=3,\"b\",0))","v":0},{"$f":"IF('S-P表'!Y29=1,1,IF('S-P表'!Y29=3,\"b\",0))","v":0},{"$f":"IF('S-P表'!Z29=1,1,IF('S-P表'!Z29=3,\"b\",0))","v":0},{"$f":"IF('S-P表'!AA29=1,1,IF('S-P表'!AA29=3,\"b\",0))","v":0},{"$f":"IF('S-P表'!AB29=1,1,IF('S-P表'!AB29=3,\"b\",0))","v":0},{"$f":"IF('S-P表'!AC29=1,1,IF('S-P表'!AC29=3,\"b\",0))","v":0},{"$f":"IF('S-P表'!AD29=1,1,IF('S-P表'!AD29=3,\"b\",0))","v":0},{"$f":"IF('S-P表'!AE29=1,1,IF('S-P表'!AE29=3,\"b\",0))","v":0},{"$f":"IF('S-P表'!AF29=1,1,IF('S-P表'!AF29=3,\"b\",0))","v":0},{"$f":"IF('S-P表'!AG29=1,1,IF('S-P表'!AG29=3,\"b\",0))","v":0},{"$f":"IF('S-P表'!AH29=1,1,IF('S-P表'!AH29=3,\"b\",0))","v":0},{"$f":"IF('S-P表'!AI29=1,1,IF('S-P表'!AI29=3,\"b\",0))","v":0},{"$f":"IF('S-P表'!AJ29=1,1,IF('S-P表'!AJ29=3,\"b\",0))","v":0},{"$f":"IF('S-P表'!AK29=1,1,IF('S-P表'!AK29=3,\"b\",0))","v":0},{"$f":"IF('S-P表'!AL29=1,1,IF('S-P表'!AL29=3,\"b\",0))","v":0},{"$f":"IF('S-P表'!AM29=1,1,IF('S-P表'!AM29=3,\"b\",0))","v":0},{"$f":"IF('S-P表'!AN29=1,1,IF('S-P表'!AN29=3,\"b\",0))","v":0},{"$f":"IF('S-P表'!AO29=1,1,IF('S-P表'!AO29=3,\"b\",0))","v":0},{"$f":"IF('S-P表'!AP29=1,1,IF('S-P表'!AP29=3,\"b\",0))","v":0},{"$f":"IF('S-P表'!AQ29=1,1,IF('S-P表'!AQ29=3,\"b\",0))","v":0},{"$f":"SUM(Sheet3!D29:'Sheet3'!AQ29)","v":0}]
[null,null,null,{"$f":"IF('S-P表'!D30=1,1,IF('S-P表'!D30=3,\"b\",0))","v":0},{"$f":"IF('S-P表'!E30=1,1,IF('S-P表'!E30=3,\"b\",0))","v":0},{"$f":"IF('S-P表'!F30=1,1,IF('S-P表'!F30=3,\"b\",0))","v":0},{"$f":"IF('S-P表'!G30=1,1,IF('S-P表'!G30=3,\"b\",0))","v":0},{"$f":"IF('S-P表'!H30=1,1,IF('S-P表'!H30=3,\"b\",0))","v":0},{"$f":"IF('S-P表'!I30=1,1,IF('S-P表'!I30=3,\"b\",0))","v":0},{"$f":"IF('S-P表'!J30=1,1,IF('S-P表'!J30=3,\"b\",0))","v":0},{"$f":"IF('S-P表'!K30=1,1,IF('S-P表'!K30=3,\"b\",0))","v":0},{"$f":"IF('S-P表'!L30=1,1,IF('S-P表'!L30=3,\"b\",0))","v":0},{"$f":"IF('S-P表'!M30=1,1,IF('S-P表'!M30=3,\"b\",0))","v":0},{"$f":"IF('S-P表'!N30=1,1,IF('S-P表'!N30=3,\"b\",0))","v":0},{"$f":"IF('S-P表'!O30=1,1,IF('S-P表'!O30=3,\"b\",0))","v":0},{"$f":"IF('S-P表'!P30=1,1,IF('S-P表'!P30=3,\"b\",0))","v":0},{"$f":"IF('S-P表'!Q30=1,1,IF('S-P表'!Q30=3,\"b\",0))","v":0},{"$f":"IF('S-P表'!R30=1,1,IF('S-P表'!R30=3,\"b\",0))","v":0},{"$f":"IF('S-P表'!S30=1,1,IF('S-P表'!S30=3,\"b\",0))","v":0},{"$f":"IF('S-P表'!T30=1,1,IF('S-P表'!T30=3,\"b\",0))","v":0},{"$f":"IF('S-P表'!U30=1,1,IF('S-P表'!U30=3,\"b\",0))","v":0},{"$f":"IF('S-P表'!V30=1,1,IF('S-P表'!V30=3,\"b\",0))","v":0},{"$f":"IF('S-P表'!W30=1,1,IF('S-P表'!W30=3,\"b\",0))","v":0},{"$f":"IF('S-P表'!X30=1,1,IF('S-P表'!X30=3,\"b\",0))","v":0},{"$f":"IF('S-P表'!Y30=1,1,IF('S-P表'!Y30=3,\"b\",0))","v":0},{"$f":"IF('S-P表'!Z30=1,1,IF('S-P表'!Z30=3,\"b\",0))","v":0},{"$f":"IF('S-P表'!AA30=1,1,IF('S-P表'!AA30=3,\"b\",0))","v":0},{"$f":"IF('S-P表'!AB30=1,1,IF('S-P表'!AB30=3,\"b\",0))","v":0},{"$f":"IF('S-P表'!AC30=1,1,IF('S-P表'!AC30=3,\"b\",0))","v":0},{"$f":"IF('S-P表'!AD30=1,1,IF('S-P表'!AD30=3,\"b\",0))","v":0},{"$f":"IF('S-P表'!AE30=1,1,IF('S-P表'!AE30=3,\"b\",0))","v":0},{"$f":"IF('S-P表'!AF30=1,1,IF('S-P表'!AF30=3,\"b\",0))","v":0},{"$f":"IF('S-P表'!AG30=1,1,IF('S-P表'!AG30=3,\"b\",0))","v":0},{"$f":"IF('S-P表'!AH30=1,1,IF('S-P表'!AH30=3,\"b\",0))","v":0},{"$f":"IF('S-P表'!AI30=1,1,IF('S-P表'!AI30=3,\"b\",0))","v":0},{"$f":"IF('S-P表'!AJ30=1,1,IF('S-P表'!AJ30=3,\"b\",0))","v":0},{"$f":"IF('S-P表'!AK30=1,1,IF('S-P表'!AK30=3,\"b\",0))","v":0},{"$f":"IF('S-P表'!AL30=1,1,IF('S-P表'!AL30=3,\"b\",0))","v":0},{"$f":"IF('S-P表'!AM30=1,1,IF('S-P表'!AM30=3,\"b\",0))","v":0},{"$f":"IF('S-P表'!AN30=1,1,IF('S-P表'!AN30=3,\"b\",0))","v":0},{"$f":"IF('S-P表'!AO30=1,1,IF('S-P表'!AO30=3,\"b\",0))","v":0},{"$f":"IF('S-P表'!AP30=1,1,IF('S-P表'!AP30=3,\"b\",0))","v":0},{"$f":"IF('S-P表'!AQ30=1,1,IF('S-P表'!AQ30=3,\"b\",0))","v":0},{"$f":"SUM(Sheet3!D30:'Sheet3'!AQ30)","v":0}]
[null,null,null,{"$f":"IF('S-P表'!D31=1,1,IF('S-P表'!D31=3,\"b\",0))","v":0},{"$f":"IF('S-P表'!E31=1,1,IF('S-P表'!E31=3,\"b\",0))","v":0},{"$f":"IF('S-P表'!F31=1,1,IF('S-P表'!F31=3,\"b\",0))","v":0},{"$f":"IF('S-P表'!G31=1,1,IF('S-P表'!G31=3,\"b\",0))","v":0},{"$f":"IF('S-P表'!H31=1,1,IF('S-P表'!H31=3,\"b\",0))","v":0},{"$f":"IF('S-P表'!I31=1,1,IF('S-P表'!I31=3,\"b\",0))","v":0},{"$f":"IF('S-P表'!J31=1,1,IF('S-P表'!J31=3,\"b\",0))","v":0},{"$f":"IF('S-P表'!K31=1,1,IF('S-P表'!K31=3,\"b\",0))","v":0},{"$f":"IF('S-P表'!L31=1,1,IF('S-P表'!L31=3,\"b\",0))","v":0},{"$f":"IF('S-P表'!M31=1,1,IF('S-P表'!M31=3,\"b\",0))","v":0},{"$f":"IF('S-P表'!N31=1,1,IF('S-P表'!N31=3,\"b\",0))","v":0},{"$f":"IF('S-P表'!O31=1,1,IF('S-P表'!O31=3,\"b\",0))","v":0},{"$f":"IF('S-P表'!P31=1,1,IF('S-P表'!P31=3,\"b\",0))","v":0},{"$f":"IF('S-P表'!Q31=1,1,IF('S-P表'!Q31=3,\"b\",0))","v":0},{"$f":"IF('S-P表'!R31=1,1,IF('S-P表'!R31=3,\"b\",0))","v":0},{"$f":"IF('S-P表'!S31=1,1,IF('S-P表'!S31=3,\"b\",0))","v":0},{"$f":"IF('S-P表'!T31=1,1,IF('S-P表'!T31=3,\"b\",0))","v":0},{"$f":"IF('S-P表'!U31=1,1,IF('S-P表'!U31=3,\"b\",0))","v":0},{"$f":"IF('S-P表'!V31=1,1,IF('S-P表'!V31=3,\"b\",0))","v":0},{"$f":"IF('S-P表'!W31=1,1,IF('S-P表'!W31=3,\"b\",0))","v":0},{"$f":"IF('S-P表'!X31=1,1,IF('S-P表'!X31=3,\"b\",0))","v":0},{"$f":"IF('S-P表'!Y31=1,1,IF('S-P表'!Y31=3,\"b\",0))","v":0},{"$f":"IF('S-P表'!Z31=1,1,IF('S-P表'!Z31=3,\"b\",0))","v":0},{"$f":"IF('S-P表'!AA31=1,1,IF('S-P表'!AA31=3,\"b\",0))","v":0},{"$f":"IF('S-P表'!AB31=1,1,IF('S-P表'!AB31=3,\"b\",0))","v":0},{"$f":"IF('S-P表'!AC31=1,1,IF('S-P表'!AC31=3,\"b\",0))","v":0},{"$f":"IF('S-P表'!AD31=1,1,IF('S-P表'!AD31=3,\"b\",0))","v":0},{"$f":"IF('S-P表'!AE31=1,1,IF('S-P表'!AE31=3,\"b\",0))","v":0},{"$f":"IF('S-P表'!AF31=1,1,IF('S-P表'!AF31=3,\"b\",0))","v":0},{"$f":"IF('S-P表'!AG31=1,1,IF('S-P表'!AG31=3,\"b\",0))","v":0},{"$f":"IF('S-P表'!AH31=1,1,IF('S-P表'!AH31=3,\"b\",0))","v":0},{"$f":"IF('S-P表'!AI31=1,1,IF('S-P表'!AI31=3,\"b\",0))","v":0},{"$f":"IF('S-P表'!AJ31=1,1,IF('S-P表'!AJ31=3,\"b\",0))","v":0},{"$f":"IF('S-P表'!AK31=1,1,IF('S-P表'!AK31=3,\"b\",0))","v":0},{"$f":"IF('S-P表'!AL31=1,1,IF('S-P表'!AL31=3,\"b\",0))","v":0},{"$f":"IF('S-P表'!AM31=1,1,IF('S-P表'!AM31=3,\"b\",0))","v":0},{"$f":"IF('S-P表'!AN31=1,1,IF('S-P表'!AN31=3,\"b\",0))","v":0},{"$f":"IF('S-P表'!AO31=1,1,IF('S-P表'!AO31=3,\"b\",0))","v":0},{"$f":"IF('S-P表'!AP31=1,1,IF('S-P表'!AP31=3,\"b\",0))","v":0},{"$f":"IF('S-P表'!AQ31=1,1,IF('S-P表'!AQ31=3,\"b\",0))","v":0},{"$f":"SUM(Sheet3!D31:'Sheet3'!AQ31)","v":0}]
[null,null,null,{"$f":"IF('S-P表'!D32=1,1,IF('S-P表'!D32=3,\"b\",0))","v":0},{"$f":"IF('S-P表'!E32=1,1,IF('S-P表'!E32=3,\"b\",0))","v":0},{"$f":"IF('S-P表'!F32=1,1,IF('S-P表'!F32=3,\"b\",0))","v":0},{"$f":"IF('S-P表'!G32=1,1,IF('S-P表'!G32=3,\"b\",0))","v":0},{"$f":"IF('S-P表'!H32=1,1,IF('S-P表'!H32=3,\"b\",0))","v":0},{"$f":"IF('S-P表'!I32=1,1,IF('S-P表'!I32=3,\"b\",0))","v":0},{"$f":"IF('S-P表'!J32=1,1,IF('S-P表'!J32=3,\"b\",0))","v":0},{"$f":"IF('S-P表'!K32=1,1,IF('S-P表'!K32=3,\"b\",0))","v":0},{"$f":"IF('S-P表'!L32=1,1,IF('S-P表'!L32=3,\"b\",0))","v":0},{"$f":"IF('S-P表'!M32=1,1,IF('S-P表'!M32=3,\"b\",0))","v":0},{"$f":"IF('S-P表'!N32=1,1,IF('S-P表'!N32=3,\"b\",0))","v":0},{"$f":"IF('S-P表'!O32=1,1,IF('S-P表'!O32=3,\"b\",0))","v":0},{"$f":"IF('S-P表'!P32=1,1,IF('S-P表'!P32=3,\"b\",0))","v":0},{"$f":"IF('S-P表'!Q32=1,1,IF('S-P表'!Q32=3,\"b\",0))","v":0},{"$f":"IF('S-P表'!R32=1,1,IF('S-P表'!R32=3,\"b\",0))","v":0},{"$f":"IF('S-P表'!S32=1,1,IF('S-P表'!S32=3,\"b\",0))","v":0},{"$f":"IF('S-P表'!T32=1,1,IF('S-P表'!T32=3,\"b\",0))","v":0},{"$f":"IF('S-P表'!U32=1,1,IF('S-P表'!U32=3,\"b\",0))","v":0},{"$f":"IF('S-P表'!V32=1,1,IF('S-P表'!V32=3,\"b\",0))","v":0},{"$f":"IF('S-P表'!W32=1,1,IF('S-P表'!W32=3,\"b\",0))","v":0},{"$f":"IF('S-P表'!X32=1,1,IF('S-P表'!X32=3,\"b\",0))","v":0},{"$f":"IF('S-P表'!Y32=1,1,IF('S-P表'!Y32=3,\"b\",0))","v":0},{"$f":"IF('S-P表'!Z32=1,1,IF('S-P表'!Z32=3,\"b\",0))","v":0},{"$f":"IF('S-P表'!AA32=1,1,IF('S-P表'!AA32=3,\"b\",0))","v":0},{"$f":"IF('S-P表'!AB32=1,1,IF('S-P表'!AB32=3,\"b\",0))","v":0},{"$f":"IF('S-P表'!AC32=1,1,IF('S-P表'!AC32=3,\"b\",0))","v":0},{"$f":"IF('S-P表'!AD32=1,1,IF('S-P表'!AD32=3,\"b\",0))","v":0},{"$f":"IF('S-P表'!AE32=1,1,IF('S-P表'!AE32=3,\"b\",0))","v":0},{"$f":"IF('S-P表'!AF32=1,1,IF('S-P表'!AF32=3,\"b\",0))","v":0},{"$f":"IF('S-P表'!AG32=1,1,IF('S-P表'!AG32=3,\"b\",0))","v":0},{"$f":"IF('S-P表'!AH32=1,1,IF('S-P表'!AH32=3,\"b\",0))","v":0},{"$f":"IF('S-P表'!AI32=1,1,IF('S-P表'!AI32=3,\"b\",0))","v":0},{"$f":"IF('S-P表'!AJ32=1,1,IF('S-P表'!AJ32=3,\"b\",0))","v":0},{"$f":"IF('S-P表'!AK32=1,1,IF('S-P表'!AK32=3,\"b\",0))","v":0},{"$f":"IF('S-P表'!AL32=1,1,IF('S-P表'!AL32=3,\"b\",0))","v":0},{"$f":"IF('S-P表'!AM32=1,1,IF('S-P表'!AM32=3,\"b\",0))","v":0},{"$f":"IF('S-P表'!AN32=1,1,IF('S-P表'!AN32=3,\"b\",0))","v":0},{"$f":"IF('S-P表'!AO32=1,1,IF('S-P表'!AO32=3,\"b\",0))","v":0},{"$f":"IF('S-P表'!AP32=1,1,IF('S-P表'!AP32=3,\"b\",0))","v":0},{"$f":"IF('S-P表'!AQ32=1,1,IF('S-P表'!AQ32=3,\"b\",0))","v":0},{"$f":"SUM(Sheet3!D32:'Sheet3'!AQ32)","v":0}]
[null,null,null,{"$f":"IF('S-P表'!D33=1,1,IF('S-P表'!D33=3,\"b\",0))","v":0},{"$f":"IF('S-P表'!E33=1,1,IF('S-P表'!E33=3,\"b\",0))","v":0},{"$f":"IF('S-P表'!F33=1,1,IF('S-P表'!F33=3,\"b\",0))","v":0},{"$f":"IF('S-P表'!G33=1,1,IF('S-P表'!G33=3,\"b\",0))","v":0},{"$f":"IF('S-P表'!H33=1,1,IF('S-P表'!H33=3,\"b\",0))","v":0},{"$f":"IF('S-P表'!I33=1,1,IF('S-P表'!I33=3,\"b\",0))","v":0},{"$f":"IF('S-P表'!J33=1,1,IF('S-P表'!J33=3,\"b\",0))","v":0},{"$f":"IF('S-P表'!K33=1,1,IF('S-P表'!K33=3,\"b\",0))","v":0},{"$f":"IF('S-P表'!L33=1,1,IF('S-P表'!L33=3,\"b\",0))","v":0},{"$f":"IF('S-P表'!M33=1,1,IF('S-P表'!M33=3,\"b\",0))","v":0},{"$f":"IF('S-P表'!N33=1,1,IF('S-P表'!N33=3,\"b\",0))","v":0},{"$f":"IF('S-P表'!O33=1,1,IF('S-P表'!O33=3,\"b\",0))","v":0},{"$f":"IF('S-P表'!P33=1,1,IF('S-P表'!P33=3,\"b\",0))","v":0},{"$f":"IF('S-P表'!Q33=1,1,IF('S-P表'!Q33=3,\"b\",0))","v":0},{"$f":"IF('S-P表'!R33=1,1,IF('S-P表'!R33=3,\"b\",0))","v":0},{"$f":"IF('S-P表'!S33=1,1,IF('S-P表'!S33=3,\"b\",0))","v":0},{"$f":"IF('S-P表'!T33=1,1,IF('S-P表'!T33=3,\"b\",0))","v":0},{"$f":"IF('S-P表'!U33=1,1,IF('S-P表'!U33=3,\"b\",0))","v":0},{"$f":"IF('S-P表'!V33=1,1,IF('S-P表'!V33=3,\"b\",0))","v":0},{"$f":"IF('S-P表'!W33=1,1,IF('S-P表'!W33=3,\"b\",0))","v":0},{"$f":"IF('S-P表'!X33=1,1,IF('S-P表'!X33=3,\"b\",0))","v":0},{"$f":"IF('S-P表'!Y33=1,1,IF('S-P表'!Y33=3,\"b\",0))","v":0},{"$f":"IF('S-P表'!Z33=1,1,IF('S-P表'!Z33=3,\"b\",0))","v":0},{"$f":"IF('S-P表'!AA33=1,1,IF('S-P表'!AA33=3,\"b\",0))","v":0},{"$f":"IF('S-P表'!AB33=1,1,IF('S-P表'!AB33=3,\"b\",0))","v":0},{"$f":"IF('S-P表'!AC33=1,1,IF('S-P表'!AC33=3,\"b\",0))","v":0},{"$f":"IF('S-P表'!AD33=1,1,IF('S-P表'!AD33=3,\"b\",0))","v":0},{"$f":"IF('S-P表'!AE33=1,1,IF('S-P表'!AE33=3,\"b\",0))","v":0},{"$f":"IF('S-P表'!AF33=1,1,IF('S-P表'!AF33=3,\"b\",0))","v":0},{"$f":"IF('S-P表'!AG33=1,1,IF('S-P表'!AG33=3,\"b\",0))","v":0},{"$f":"IF('S-P表'!AH33=1,1,IF('S-P表'!AH33=3,\"b\",0))","v":0},{"$f":"IF('S-P表'!AI33=1,1,IF('S-P表'!AI33=3,\"b\",0))","v":0},{"$f":"IF('S-P表'!AJ33=1,1,IF('S-P表'!AJ33=3,\"b\",0))","v":0},{"$f":"IF('S-P表'!AK33=1,1,IF('S-P表'!AK33=3,\"b\",0))","v":0},{"$f":"IF('S-P表'!AL33=1,1,IF('S-P表'!AL33=3,\"b\",0))","v":0},{"$f":"IF('S-P表'!AM33=1,1,IF('S-P表'!AM33=3,\"b\",0))","v":0},{"$f":"IF('S-P表'!AN33=1,1,IF('S-P表'!AN33=3,\"b\",0))","v":0},{"$f":"IF('S-P表'!AO33=1,1,IF('S-P表'!AO33=3,\"b\",0))","v":0},{"$f":"IF('S-P表'!AP33=1,1,IF('S-P表'!AP33=3,\"b\",0))","v":0},{"$f":"IF('S-P表'!AQ33=1,1,IF('S-P表'!AQ33=3,\"b\",0))","v":0},{"$f":"SUM(Sheet3!D33:'Sheet3'!AQ33)","v":0}]
[null,null,null,{"$f":"IF('S-P表'!D34=1,1,IF('S-P表'!D34=3,\"b\",0))","v":0},{"$f":"IF('S-P表'!E34=1,1,IF('S-P表'!E34=3,\"b\",0))","v":0},{"$f":"IF('S-P表'!F34=1,1,IF('S-P表'!F34=3,\"b\",0))","v":0},{"$f":"IF('S-P表'!G34=1,1,IF('S-P表'!G34=3,\"b\",0))","v":0},{"$f":"IF('S-P表'!H34=1,1,IF('S-P表'!H34=3,\"b\",0))","v":0},{"$f":"IF('S-P表'!I34=1,1,IF('S-P表'!I34=3,\"b\",0))","v":0},{"$f":"IF('S-P表'!J34=1,1,IF('S-P表'!J34=3,\"b\",0))","v":0},{"$f":"IF('S-P表'!K34=1,1,IF('S-P表'!K34=3,\"b\",0))","v":0},{"$f":"IF('S-P表'!L34=1,1,IF('S-P表'!L34=3,\"b\",0))","v":0},{"$f":"IF('S-P表'!M34=1,1,IF('S-P表'!M34=3,\"b\",0))","v":0},{"$f":"IF('S-P表'!N34=1,1,IF('S-P表'!N34=3,\"b\",0))","v":0},{"$f":"IF('S-P表'!O34=1,1,IF('S-P表'!O34=3,\"b\",0))","v":0},{"$f":"IF('S-P表'!P34=1,1,IF('S-P表'!P34=3,\"b\",0))","v":0},{"$f":"IF('S-P表'!Q34=1,1,IF('S-P表'!Q34=3,\"b\",0))","v":0},{"$f":"IF('S-P表'!R34=1,1,IF('S-P表'!R34=3,\"b\",0))","v":0},{"$f":"IF('S-P表'!S34=1,1,IF('S-P表'!S34=3,\"b\",0))","v":0},{"$f":"IF('S-P表'!T34=1,1,IF('S-P表'!T34=3,\"b\",0))","v":0},{"$f":"IF('S-P表'!U34=1,1,IF('S-P表'!U34=3,\"b\",0))","v":0},{"$f":"IF('S-P表'!V34=1,1,IF('S-P表'!V34=3,\"b\",0))","v":0},{"$f":"IF('S-P表'!W34=1,1,IF('S-P表'!W34=3,\"b\",0))","v":0},{"$f":"IF('S-P表'!X34=1,1,IF('S-P表'!X34=3,\"b\",0))","v":0},{"$f":"IF('S-P表'!Y34=1,1,IF('S-P表'!Y34=3,\"b\",0))","v":0},{"$f":"IF('S-P表'!Z34=1,1,IF('S-P表'!Z34=3,\"b\",0))","v":0},{"$f":"IF('S-P表'!AA34=1,1,IF('S-P表'!AA34=3,\"b\",0))","v":0},{"$f":"IF('S-P表'!AB34=1,1,IF('S-P表'!AB34=3,\"b\",0))","v":0},{"$f":"IF('S-P表'!AC34=1,1,IF('S-P表'!AC34=3,\"b\",0))","v":0},{"$f":"IF('S-P表'!AD34=1,1,IF('S-P表'!AD34=3,\"b\",0))","v":0},{"$f":"IF('S-P表'!AE34=1,1,IF('S-P表'!AE34=3,\"b\",0))","v":0},{"$f":"IF('S-P表'!AF34=1,1,IF('S-P表'!AF34=3,\"b\",0))","v":0},{"$f":"IF('S-P表'!AG34=1,1,IF('S-P表'!AG34=3,\"b\",0))","v":0},{"$f":"IF('S-P表'!AH34=1,1,IF('S-P表'!AH34=3,\"b\",0))","v":0},{"$f":"IF('S-P表'!AI34=1,1,IF('S-P表'!AI34=3,\"b\",0))","v":0},{"$f":"IF('S-P表'!AJ34=1,1,IF('S-P表'!AJ34=3,\"b\",0))","v":0},{"$f":"IF('S-P表'!AK34=1,1,IF('S-P表'!AK34=3,\"b\",0))","v":0},{"$f":"IF('S-P表'!AL34=1,1,IF('S-P表'!AL34=3,\"b\",0))","v":0},{"$f":"IF('S-P表'!AM34=1,1,IF('S-P表'!AM34=3,\"b\",0))","v":0},{"$f":"IF('S-P表'!AN34=1,1,IF('S-P表'!AN34=3,\"b\",0))","v":0},{"$f":"IF('S-P表'!AO34=1,1,IF('S-P表'!AO34=3,\"b\",0))","v":0},{"$f":"IF('S-P表'!AP34=1,1,IF('S-P表'!AP34=3,\"b\",0))","v":0},{"$f":"IF('S-P表'!AQ34=1,1,IF('S-P表'!AQ34=3,\"b\",0))","v":0},{"$f":"SUM(Sheet3!D34:'Sheet3'!AQ34)","v":0}]
[null,null,null,{"$f":"IF('S-P表'!D35=1,1,IF('S-P表'!D35=3,\"b\",0))","v":0},{"$f":"IF('S-P表'!E35=1,1,IF('S-P表'!E35=3,\"b\",0))","v":0},{"$f":"IF('S-P表'!F35=1,1,IF('S-P表'!F35=3,\"b\",0))","v":0},{"$f":"IF('S-P表'!G35=1,1,IF('S-P表'!G35=3,\"b\",0))","v":0},{"$f":"IF('S-P表'!H35=1,1,IF('S-P表'!H35=3,\"b\",0))","v":0},{"$f":"IF('S-P表'!I35=1,1,IF('S-P表'!I35=3,\"b\",0))","v":0},{"$f":"IF('S-P表'!J35=1,1,IF('S-P表'!J35=3,\"b\",0))","v":0},{"$f":"IF('S-P表'!K35=1,1,IF('S-P表'!K35=3,\"b\",0))","v":0},{"$f":"IF('S-P表'!L35=1,1,IF('S-P表'!L35=3,\"b\",0))","v":0},{"$f":"IF('S-P表'!M35=1,1,IF('S-P表'!M35=3,\"b\",0))","v":0},{"$f":"IF('S-P表'!N35=1,1,IF('S-P表'!N35=3,\"b\",0))","v":0},{"$f":"IF('S-P表'!O35=1,1,IF('S-P表'!O35=3,\"b\",0))","v":0},{"$f":"IF('S-P表'!P35=1,1,IF('S-P表'!P35=3,\"b\",0))","v":0},{"$f":"IF('S-P表'!Q35=1,1,IF('S-P表'!Q35=3,\"b\",0))","v":0},{"$f":"IF('S-P表'!R35=1,1,IF('S-P表'!R35=3,\"b\",0))","v":0},{"$f":"IF('S-P表'!S35=1,1,IF('S-P表'!S35=3,\"b\",0))","v":0},{"$f":"IF('S-P表'!T35=1,1,IF('S-P表'!T35=3,\"b\",0))","v":0},{"$f":"IF('S-P表'!U35=1,1,IF('S-P表'!U35=3,\"b\",0))","v":0},{"$f":"IF('S-P表'!V35=1,1,IF('S-P表'!V35=3,\"b\",0))","v":0},{"$f":"IF('S-P表'!W35=1,1,IF('S-P表'!W35=3,\"b\",0))","v":0},{"$f":"IF('S-P表'!X35=1,1,IF('S-P表'!X35=3,\"b\",0))","v":0},{"$f":"IF('S-P表'!Y35=1,1,IF('S-P表'!Y35=3,\"b\",0))","v":0},{"$f":"IF('S-P表'!Z35=1,1,IF('S-P表'!Z35=3,\"b\",0))","v":0},{"$f":"IF('S-P表'!AA35=1,1,IF('S-P表'!AA35=3,\"b\",0))","v":0},{"$f":"IF('S-P表'!AB35=1,1,IF('S-P表'!AB35=3,\"b\",0))","v":0},{"$f":"IF('S-P表'!AC35=1,1,IF('S-P表'!AC35=3,\"b\",0))","v":0},{"$f":"IF('S-P表'!AD35=1,1,IF('S-P表'!AD35=3,\"b\",0))","v":0},{"$f":"IF('S-P表'!AE35=1,1,IF('S-P表'!AE35=3,\"b\",0))","v":0},{"$f":"IF('S-P表'!AF35=1,1,IF('S-P表'!AF35=3,\"b\",0))","v":0},{"$f":"IF('S-P表'!AG35=1,1,IF('S-P表'!AG35=3,\"b\",0))","v":0},{"$f":"IF('S-P表'!AH35=1,1,IF('S-P表'!AH35=3,\"b\",0))","v":0},{"$f":"IF('S-P表'!AI35=1,1,IF('S-P表'!AI35=3,\"b\",0))","v":0},{"$f":"IF('S-P表'!AJ35=1,1,IF('S-P表'!AJ35=3,\"b\",0))","v":0},{"$f":"IF('S-P表'!AK35=1,1,IF('S-P表'!AK35=3,\"b\",0))","v":0},{"$f":"IF('S-P表'!AL35=1,1,IF('S-P表'!AL35=3,\"b\",0))","v":0},{"$f":"IF('S-P表'!AM35=1,1,IF('S-P表'!AM35=3,\"b\",0))","v":0},{"$f":"IF('S-P表'!AN35=1,1,IF('S-P表'!AN35=3,\"b\",0))","v":0},{"$f":"IF('S-P表'!AO35=1,1,IF('S-P表'!AO35=3,\"b\",0))","v":0},{"$f":"IF('S-P表'!AP35=1,1,IF('S-P表'!AP35=3,\"b\",0))","v":0},{"$f":"IF('S-P表'!AQ35=1,1,IF('S-P表'!AQ35=3,\"b\",0))","v":0},{"$f":"SUM(Sheet3!D35:'Sheet3'!AQ35)","v":0}]
[null,null,null,{"$f":"IF('S-P表'!D36=1,1,IF('S-P表'!D36=3,\"b\",0))","v":0},{"$f":"IF('S-P表'!E36=1,1,IF('S-P表'!E36=3,\"b\",0))","v":0},{"$f":"IF('S-P表'!F36=1,1,IF('S-P表'!F36=3,\"b\",0))","v":0},{"$f":"IF('S-P表'!G36=1,1,IF('S-P表'!G36=3,\"b\",0))","v":0},{"$f":"IF('S-P表'!H36=1,1,IF('S-P表'!H36=3,\"b\",0))","v":0},{"$f":"IF('S-P表'!I36=1,1,IF('S-P表'!I36=3,\"b\",0))","v":0},{"$f":"IF('S-P表'!J36=1,1,IF('S-P表'!J36=3,\"b\",0))","v":0},{"$f":"IF('S-P表'!K36=1,1,IF('S-P表'!K36=3,\"b\",0))","v":0},{"$f":"IF('S-P表'!L36=1,1,IF('S-P表'!L36=3,\"b\",0))","v":0},{"$f":"IF('S-P表'!M36=1,1,IF('S-P表'!M36=3,\"b\",0))","v":0},{"$f":"IF('S-P表'!N36=1,1,IF('S-P表'!N36=3,\"b\",0))","v":0},{"$f":"IF('S-P表'!O36=1,1,IF('S-P表'!O36=3,\"b\",0))","v":0},{"$f":"IF('S-P表'!P36=1,1,IF('S-P表'!P36=3,\"b\",0))","v":0},{"$f":"IF('S-P表'!Q36=1,1,IF('S-P表'!Q36=3,\"b\",0))","v":0},{"$f":"IF('S-P表'!R36=1,1,IF('S-P表'!R36=3,\"b\",0))","v":0},{"$f":"IF('S-P表'!S36=1,1,IF('S-P表'!S36=3,\"b\",0))","v":0},{"$f":"IF('S-P表'!T36=1,1,IF('S-P表'!T36=3,\"b\",0))","v":0},{"$f":"IF('S-P表'!U36=1,1,IF('S-P表'!U36=3,\"b\",0))","v":0},{"$f":"IF('S-P表'!V36=1,1,IF('S-P表'!V36=3,\"b\",0))","v":0},{"$f":"IF('S-P表'!W36=1,1,IF('S-P表'!W36=3,\"b\",0))","v":0},{"$f":"IF('S-P表'!X36=1,1,IF('S-P表'!X36=3,\"b\",0))","v":0},{"$f":"IF('S-P表'!Y36=1,1,IF('S-P表'!Y36=3,\"b\",0))","v":0},{"$f":"IF('S-P表'!Z36=1,1,IF('S-P表'!Z36=3,\"b\",0))","v":0},{"$f":"IF('S-P表'!AA36=1,1,IF('S-P表'!AA36=3,\"b\",0))","v":0},{"$f":"IF('S-P表'!AB36=1,1,IF('S-P表'!AB36=3,\"b\",0))","v":0},{"$f":"IF('S-P表'!AC36=1,1,IF('S-P表'!AC36=3,\"b\",0))","v":0},{"$f":"IF('S-P表'!AD36=1,1,IF('S-P表'!AD36=3,\"b\",0))","v":0},{"$f":"IF('S-P表'!AE36=1,1,IF('S-P表'!AE36=3,\"b\",0))","v":0},{"$f":"IF('S-P表'!AF36=1,1,IF('S-P表'!AF36=3,\"b\",0))","v":0},{"$f":"IF('S-P表'!AG36=1,1,IF('S-P表'!AG36=3,\"b\",0))","v":0},{"$f":"IF('S-P表'!AH36=1,1,IF('S-P表'!AH36=3,\"b\",0))","v":0},{"$f":"IF('S-P表'!AI36=1,1,IF('S-P表'!AI36=3,\"b\",0))","v":0},{"$f":"IF('S-P表'!AJ36=1,1,IF('S-P表'!AJ36=3,\"b\",0))","v":0},{"$f":"IF('S-P表'!AK36=1,1,IF('S-P表'!AK36=3,\"b\",0))","v":0},{"$f":"IF('S-P表'!AL36=1,1,IF('S-P表'!AL36=3,\"b\",0))","v":0},{"$f":"IF('S-P表'!AM36=1,1,IF('S-P表'!AM36=3,\"b\",0))","v":0},{"$f":"IF('S-P表'!AN36=1,1,IF('S-P表'!AN36=3,\"b\",0))","v":0},{"$f":"IF('S-P表'!AO36=1,1,IF('S-P表'!AO36=3,\"b\",0))","v":0},{"$f":"IF('S-P表'!AP36=1,1,IF('S-P表'!AP36=3,\"b\",0))","v":0},{"$f":"IF('S-P表'!AQ36=1,1,IF('S-P表'!AQ36=3,\"b\",0))","v":0},{"$f":"SUM(Sheet3!D36:'Sheet3'!AQ36)","v":0}]
[null,null,null,{"$f":"IF('S-P表'!D37=1,1,IF('S-P表'!D37=3,\"b\",0))","v":0},{"$f":"IF('S-P表'!E37=1,1,IF('S-P表'!E37=3,\"b\",0))","v":0},{"$f":"IF('S-P表'!F37=1,1,IF('S-P表'!F37=3,\"b\",0))","v":0},{"$f":"IF('S-P表'!G37=1,1,IF('S-P表'!G37=3,\"b\",0))","v":0},{"$f":"IF('S-P表'!H37=1,1,IF('S-P表'!H37=3,\"b\",0))","v":0},{"$f":"IF('S-P表'!I37=1,1,IF('S-P表'!I37=3,\"b\",0))","v":0},{"$f":"IF('S-P表'!J37=1,1,IF('S-P表'!J37=3,\"b\",0))","v":0},{"$f":"IF('S-P表'!K37=1,1,IF('S-P表'!K37=3,\"b\",0))","v":0},{"$f":"IF('S-P表'!L37=1,1,IF('S-P表'!L37=3,\"b\",0))","v":0},{"$f":"IF('S-P表'!M37=1,1,IF('S-P表'!M37=3,\"b\",0))","v":0},{"$f":"IF('S-P表'!N37=1,1,IF('S-P表'!N37=3,\"b\",0))","v":0},{"$f":"IF('S-P表'!O37=1,1,IF('S-P表'!O37=3,\"b\",0))","v":0},{"$f":"IF('S-P表'!P37=1,1,IF('S-P表'!P37=3,\"b\",0))","v":0},{"$f":"IF('S-P表'!Q37=1,1,IF('S-P表'!Q37=3,\"b\",0))","v":0},{"$f":"IF('S-P表'!R37=1,1,IF('S-P表'!R37=3,\"b\",0))","v":0},{"$f":"IF('S-P表'!S37=1,1,IF('S-P表'!S37=3,\"b\",0))","v":0},{"$f":"IF('S-P表'!T37=1,1,IF('S-P表'!T37=3,\"b\",0))","v":0},{"$f":"IF('S-P表'!U37=1,1,IF('S-P表'!U37=3,\"b\",0))","v":0},{"$f":"IF('S-P表'!V37=1,1,IF('S-P表'!V37=3,\"b\",0))","v":0},{"$f":"IF('S-P表'!W37=1,1,IF('S-P表'!W37=3,\"b\",0))","v":0},{"$f":"IF('S-P表'!X37=1,1,IF('S-P表'!X37=3,\"b\",0))","v":0},{"$f":"IF('S-P表'!Y37=1,1,IF('S-P表'!Y37=3,\"b\",0))","v":0},{"$f":"IF('S-P表'!Z37=1,1,IF('S-P表'!Z37=3,\"b\",0))","v":0},{"$f":"IF('S-P表'!AA37=1,1,IF('S-P表'!AA37=3,\"b\",0))","v":0},{"$f":"IF('S-P表'!AB37=1,1,IF('S-P表'!AB37=3,\"b\",0))","v":0},{"$f":"IF('S-P表'!AC37=1,1,IF('S-P表'!AC37=3,\"b\",0))","v":0},{"$f":"IF('S-P表'!AD37=1,1,IF('S-P表'!AD37=3,\"b\",0))","v":0},{"$f":"IF('S-P表'!AE37=1,1,IF('S-P表'!AE37=3,\"b\",0))","v":0},{"$f":"IF('S-P表'!AF37=1,1,IF('S-P表'!AF37=3,\"b\",0))","v":0},{"$f":"IF('S-P表'!AG37=1,1,IF('S-P表'!AG37=3,\"b\",0))","v":0},{"$f":"IF('S-P表'!AH37=1,1,IF('S-P表'!AH37=3,\"b\",0))","v":0},{"$f":"IF('S-P表'!AI37=1,1,IF('S-P表'!AI37=3,\"b\",0))","v":0},{"$f":"IF('S-P表'!AJ37=1,1,IF('S-P表'!AJ37=3,\"b\",0))","v":0},{"$f":"IF('S-P表'!AK37=1,1,IF('S-P表'!AK37=3,\"b\",0))","v":0},{"$f":"IF('S-P表'!AL37=1,1,IF('S-P表'!AL37=3,\"b\",0))","v":0},{"$f":"IF('S-P表'!AM37=1,1,IF('S-P表'!AM37=3,\"b\",0))","v":0},{"$f":"IF('S-P表'!AN37=1,1,IF('S-P表'!AN37=3,\"b\",0))","v":0},{"$f":"IF('S-P表'!AO37=1,1,IF('S-P表'!AO37=3,\"b\",0))","v":0},{"$f":"IF('S-P表'!AP37=1,1,IF('S-P表'!AP37=3,\"b\",0))","v":0},{"$f":"IF('S-P表'!AQ37=1,1,IF('S-P表'!AQ37=3,\"b\",0))","v":0},{"$f":"SUM(Sheet3!D37:'Sheet3'!AQ37)","v":0}]
[null,null,null,{"$f":"IF('S-P表'!D38=1,1,IF('S-P表'!D38=3,\"b\",0))","v":0},{"$f":"IF('S-P表'!E38=1,1,IF('S-P表'!E38=3,\"b\",0))","v":0},{"$f":"IF('S-P表'!F38=1,1,IF('S-P表'!F38=3,\"b\",0))","v":0},{"$f":"IF('S-P表'!G38=1,1,IF('S-P表'!G38=3,\"b\",0))","v":0},{"$f":"IF('S-P表'!H38=1,1,IF('S-P表'!H38=3,\"b\",0))","v":0},{"$f":"IF('S-P表'!I38=1,1,IF('S-P表'!I38=3,\"b\",0))","v":0},{"$f":"IF('S-P表'!J38=1,1,IF('S-P表'!J38=3,\"b\",0))","v":0},{"$f":"IF('S-P表'!K38=1,1,IF('S-P表'!K38=3,\"b\",0))","v":0},{"$f":"IF('S-P表'!L38=1,1,IF('S-P表'!L38=3,\"b\",0))","v":0},{"$f":"IF('S-P表'!M38=1,1,IF('S-P表'!M38=3,\"b\",0))","v":0},{"$f":"IF('S-P表'!N38=1,1,IF('S-P表'!N38=3,\"b\",0))","v":0},{"$f":"IF('S-P表'!O38=1,1,IF('S-P表'!O38=3,\"b\",0))","v":0},{"$f":"IF('S-P表'!P38=1,1,IF('S-P表'!P38=3,\"b\",0))","v":0},{"$f":"IF('S-P表'!Q38=1,1,IF('S-P表'!Q38=3,\"b\",0))","v":0},{"$f":"IF('S-P表'!R38=1,1,IF('S-P表'!R38=3,\"b\",0))","v":0},{"$f":"IF('S-P表'!S38=1,1,IF('S-P表'!S38=3,\"b\",0))","v":0},{"$f":"IF('S-P表'!T38=1,1,IF('S-P表'!T38=3,\"b\",0))","v":0},{"$f":"IF('S-P表'!U38=1,1,IF('S-P表'!U38=3,\"b\",0))","v":0},{"$f":"IF('S-P表'!V38=1,1,IF('S-P表'!V38=3,\"b\",0))","v":0},{"$f":"IF('S-P表'!W38=1,1,IF('S-P表'!W38=3,\"b\",0))","v":0},{"$f":"IF('S-P表'!X38=1,1,IF('S-P表'!X38=3,\"b\",0))","v":0},{"$f":"IF('S-P表'!Y38=1,1,IF('S-P表'!Y38=3,\"b\",0))","v":0},{"$f":"IF('S-P表'!Z38=1,1,IF('S-P表'!Z38=3,\"b\",0))","v":0},{"$f":"IF('S-P表'!AA38=1,1,IF('S-P表'!AA38=3,\"b\",0))","v":0},{"$f":"IF('S-P表'!AB38=1,1,IF('S-P表'!AB38=3,\"b\",0))","v":0},{"$f":"IF('S-P表'!AC38=1,1,IF('S-P表'!AC38=3,\"b\",0))","v":0},{"$f":"IF('S-P表'!AD38=1,1,IF('S-P表'!AD38=3,\"b\",0))","v":0},{"$f":"IF('S-P表'!AE38=1,1,IF('S-P表'!AE38=3,\"b\",0))","v":0},{"$f":"IF('S-P表'!AF38=1,1,IF('S-P表'!AF38=3,\"b\",0))","v":0},{"$f":"IF('S-P表'!AG38=1,1,IF('S-P表'!AG38=3,\"b\",0))","v":0},{"$f":"IF('S-P表'!AH38=1,1,IF('S-P表'!AH38=3,\"b\",0))","v":0},{"$f":"IF('S-P表'!AI38=1,1,IF('S-P表'!AI38=3,\"b\",0))","v":0},{"$f":"IF('S-P表'!AJ38=1,1,IF('S-P表'!AJ38=3,\"b\",0))","v":0},{"$f":"IF('S-P表'!AK38=1,1,IF('S-P表'!AK38=3,\"b\",0))","v":0},{"$f":"IF('S-P表'!AL38=1,1,IF('S-P表'!AL38=3,\"b\",0))","v":0},{"$f":"IF('S-P表'!AM38=1,1,IF('S-P表'!AM38=3,\"b\",0))","v":0},{"$f":"IF('S-P表'!AN38=1,1,IF('S-P表'!AN38=3,\"b\",0))","v":0},{"$f":"IF('S-P表'!AO38=1,1,IF('S-P表'!AO38=3,\"b\",0))","v":0},{"$f":"IF('S-P表'!AP38=1,1,IF('S-P表'!AP38=3,\"b\",0))","v":0},{"$f":"IF('S-P表'!AQ38=1,1,IF('S-P表'!AQ38=3,\"b\",0))","v":0},{"$f":"SUM(Sheet3!D38:'Sheet3'!AQ38)","v":0}]
[null,null,null,{"$f":"IF('S-P表'!D39=1,1,IF('S-P表'!D39=3,\"b\",0))","v":0},{"$f":"IF('S-P表'!E39=1,1,IF('S-P表'!E39=3,\"b\",0))","v":0},{"$f":"IF('S-P表'!F39=1,1,IF('S-P表'!F39=3,\"b\",0))","v":0},{"$f":"IF('S-P表'!G39=1,1,IF('S-P表'!G39=3,\"b\",0))","v":0},{"$f":"IF('S-P表'!H39=1,1,IF('S-P表'!H39=3,\"b\",0))","v":0},{"$f":"IF('S-P表'!I39=1,1,IF('S-P表'!I39=3,\"b\",0))","v":0},{"$f":"IF('S-P表'!J39=1,1,IF('S-P表'!J39=3,\"b\",0))","v":0},{"$f":"IF('S-P表'!K39=1,1,IF('S-P表'!K39=3,\"b\",0))","v":0},{"$f":"IF('S-P表'!L39=1,1,IF('S-P表'!L39=3,\"b\",0))","v":0},{"$f":"IF('S-P表'!M39=1,1,IF('S-P表'!M39=3,\"b\",0))","v":0},{"$f":"IF('S-P表'!N39=1,1,IF('S-P表'!N39=3,\"b\",0))","v":0},{"$f":"IF('S-P表'!O39=1,1,IF('S-P表'!O39=3,\"b\",0))","v":0},{"$f":"IF('S-P表'!P39=1,1,IF('S-P表'!P39=3,\"b\",0))","v":0},{"$f":"IF('S-P表'!Q39=1,1,IF('S-P表'!Q39=3,\"b\",0))","v":0},{"$f":"IF('S-P表'!R39=1,1,IF('S-P表'!R39=3,\"b\",0))","v":0},{"$f":"IF('S-P表'!S39=1,1,IF('S-P表'!S39=3,\"b\",0))","v":0},{"$f":"IF('S-P表'!T39=1,1,IF('S-P表'!T39=3,\"b\",0))","v":0},{"$f":"IF('S-P表'!U39=1,1,IF('S-P表'!U39=3,\"b\",0))","v":0},{"$f":"IF('S-P表'!V39=1,1,IF('S-P表'!V39=3,\"b\",0))","v":0},{"$f":"IF('S-P表'!W39=1,1,IF('S-P表'!W39=3,\"b\",0))","v":0},{"$f":"IF('S-P表'!X39=1,1,IF('S-P表'!X39=3,\"b\",0))","v":0},{"$f":"IF('S-P表'!Y39=1,1,IF('S-P表'!Y39=3,\"b\",0))","v":0},{"$f":"IF('S-P表'!Z39=1,1,IF('S-P表'!Z39=3,\"b\",0))","v":0},{"$f":"IF('S-P表'!AA39=1,1,IF('S-P表'!AA39=3,\"b\",0))","v":0},{"$f":"IF('S-P表'!AB39=1,1,IF('S-P表'!AB39=3,\"b\",0))","v":0},{"$f":"IF('S-P表'!AC39=1,1,IF('S-P表'!AC39=3,\"b\",0))","v":0},{"$f":"IF('S-P表'!AD39=1,1,IF('S-P表'!AD39=3,\"b\",0))","v":0},{"$f":"IF('S-P表'!AE39=1,1,IF('S-P表'!AE39=3,\"b\",0))","v":0},{"$f":"IF('S-P表'!AF39=1,1,IF('S-P表'!AF39=3,\"b\",0))","v":0},{"$f":"IF('S-P表'!AG39=1,1,IF('S-P表'!AG39=3,\"b\",0))","v":0},{"$f":"IF('S-P表'!AH39=1,1,IF('S-P表'!AH39=3,\"b\",0))","v":0},{"$f":"IF('S-P表'!AI39=1,1,IF('S-P表'!AI39=3,\"b\",0))","v":0},{"$f":"IF('S-P表'!AJ39=1,1,IF('S-P表'!AJ39=3,\"b\",0))","v":0},{"$f":"IF('S-P表'!AK39=1,1,IF('S-P表'!AK39=3,\"b\",0))","v":0},{"$f":"IF('S-P表'!AL39=1,1,IF('S-P表'!AL39=3,\"b\",0))","v":0},{"$f":"IF('S-P表'!AM39=1,1,IF('S-P表'!AM39=3,\"b\",0))","v":0},{"$f":"IF('S-P表'!AN39=1,1,IF('S-P表'!AN39=3,\"b\",0))","v":0},{"$f":"IF('S-P表'!AO39=1,1,IF('S-P表'!AO39=3,\"b\",0))","v":0},{"$f":"IF('S-P表'!AP39=1,1,IF('S-P表'!AP39=3,\"b\",0))","v":0},{"$f":"IF('S-P表'!AQ39=1,1,IF('S-P表'!AQ39=3,\"b\",0))","v":0},{"$f":"SUM(Sheet3!D39:'Sheet3'!AQ39)","v":0}]
[null,null,null,{"$f":"IF('S-P表'!D40=1,1,IF('S-P表'!D40=3,\"b\",0))","v":0},{"$f":"IF('S-P表'!E40=1,1,IF('S-P表'!E40=3,\"b\",0))","v":0},{"$f":"IF('S-P表'!F40=1,1,IF('S-P表'!F40=3,\"b\",0))","v":0},{"$f":"IF('S-P表'!G40=1,1,IF('S-P表'!G40=3,\"b\",0))","v":0},{"$f":"IF('S-P表'!H40=1,1,IF('S-P表'!H40=3,\"b\",0))","v":0},{"$f":"IF('S-P表'!I40=1,1,IF('S-P表'!I40=3,\"b\",0))","v":0},{"$f":"IF('S-P表'!J40=1,1,IF('S-P表'!J40=3,\"b\",0))","v":0},{"$f":"IF('S-P表'!K40=1,1,IF('S-P表'!K40=3,\"b\",0))","v":0},{"$f":"IF('S-P表'!L40=1,1,IF('S-P表'!L40=3,\"b\",0))","v":0},{"$f":"IF('S-P表'!M40=1,1,IF('S-P表'!M40=3,\"b\",0))","v":0},{"$f":"IF('S-P表'!N40=1,1,IF('S-P表'!N40=3,\"b\",0))","v":0},{"$f":"IF('S-P表'!O40=1,1,IF('S-P表'!O40=3,\"b\",0))","v":0},{"$f":"IF('S-P表'!P40=1,1,IF('S-P表'!P40=3,\"b\",0))","v":0},{"$f":"IF('S-P表'!Q40=1,1,IF('S-P表'!Q40=3,\"b\",0))","v":0},{"$f":"IF('S-P表'!R40=1,1,IF('S-P表'!R40=3,\"b\",0))","v":0},{"$f":"IF('S-P表'!S40=1,1,IF('S-P表'!S40=3,\"b\",0))","v":0},{"$f":"IF('S-P表'!T40=1,1,IF('S-P表'!T40=3,\"b\",0))","v":0},{"$f":"IF('S-P表'!U40=1,1,IF('S-P表'!U40=3,\"b\",0))","v":0},{"$f":"IF('S-P表'!V40=1,1,IF('S-P表'!V40=3,\"b\",0))","v":0},{"$f":"IF('S-P表'!W40=1,1,IF('S-P表'!W40=3,\"b\",0))","v":0},{"$f":"IF('S-P表'!X40=1,1,IF('S-P表'!X40=3,\"b\",0))","v":0},{"$f":"IF('S-P表'!Y40=1,1,IF('S-P表'!Y40=3,\"b\",0))","v":0},{"$f":"IF('S-P表'!Z40=1,1,IF('S-P表'!Z40=3,\"b\",0))","v":0},{"$f":"IF('S-P表'!AA40=1,1,IF('S-P表'!AA40=3,\"b\",0))","v":0},{"$f":"IF('S-P表'!AB40=1,1,IF('S-P表'!AB40=3,\"b\",0))","v":0},{"$f":"IF('S-P表'!AC40=1,1,IF('S-P表'!AC40=3,\"b\",0))","v":0},{"$f":"IF('S-P表'!AD40=1,1,IF('S-P表'!AD40=3,\"b\",0))","v":0},{"$f":"IF('S-P表'!AE40=1,1,IF('S-P表'!AE40=3,\"b\",0))","v":0},{"$f":"IF('S-P表'!AF40=1,1,IF('S-P表'!AF40=3,\"b\",0))","v":0},{"$f":"IF('S-P表'!AG40=1,1,IF('S-P表'!AG40=3,\"b\",0))","v":0},{"$f":"IF('S-P表'!AH40=1,1,IF('S-P表'!AH40=3,\"b\",0))","v":0},{"$f":"IF('S-P表'!AI40=1,1,IF('S-P表'!AI40=3,\"b\",0))","v":0},{"$f":"IF('S-P表'!AJ40=1,1,IF('S-P表'!AJ40=3,\"b\",0))","v":0},{"$f":"IF('S-P表'!AK40=1,1,IF('S-P表'!AK40=3,\"b\",0))","v":0},{"$f":"IF('S-P表'!AL40=1,1,IF('S-P表'!AL40=3,\"b\",0))","v":0},{"$f":"IF('S-P表'!AM40=1,1,IF('S-P表'!AM40=3,\"b\",0))","v":0},{"$f":"IF('S-P表'!AN40=1,1,IF('S-P表'!AN40=3,\"b\",0))","v":0},{"$f":"IF('S-P表'!AO40=1,1,IF('S-P表'!AO40=3,\"b\",0))","v":0},{"$f":"IF('S-P表'!AP40=1,1,IF('S-P表'!AP40=3,\"b\",0))","v":0},{"$f":"IF('S-P表'!AQ40=1,1,IF('S-P表'!AQ40=3,\"b\",0))","v":0},{"$f":"SUM(Sheet3!D40:'Sheet3'!AQ40)","v":0}]
[null,null,null,{"$f":"IF('S-P表'!D41=1,1,IF('S-P表'!D41=3,\"b\",0))","v":0},{"$f":"IF('S-P表'!E41=1,1,IF('S-P表'!E41=3,\"b\",0))","v":0},{"$f":"IF('S-P表'!F41=1,1,IF('S-P表'!F41=3,\"b\",0))","v":0},{"$f":"IF('S-P表'!G41=1,1,IF('S-P表'!G41=3,\"b\",0))","v":0},{"$f":"IF('S-P表'!H41=1,1,IF('S-P表'!H41=3,\"b\",0))","v":0},{"$f":"IF('S-P表'!I41=1,1,IF('S-P表'!I41=3,\"b\",0))","v":0},{"$f":"IF('S-P表'!J41=1,1,IF('S-P表'!J41=3,\"b\",0))","v":0},{"$f":"IF('S-P表'!K41=1,1,IF('S-P表'!K41=3,\"b\",0))","v":0},{"$f":"IF('S-P表'!L41=1,1,IF('S-P表'!L41=3,\"b\",0))","v":0},{"$f":"IF('S-P表'!M41=1,1,IF('S-P表'!M41=3,\"b\",0))","v":0},{"$f":"IF('S-P表'!N41=1,1,IF('S-P表'!N41=3,\"b\",0))","v":0},{"$f":"IF('S-P表'!O41=1,1,IF('S-P表'!O41=3,\"b\",0))","v":0},{"$f":"IF('S-P表'!P41=1,1,IF('S-P表'!P41=3,\"b\",0))","v":0},{"$f":"IF('S-P表'!Q41=1,1,IF('S-P表'!Q41=3,\"b\",0))","v":0},{"$f":"IF('S-P表'!R41=1,1,IF('S-P表'!R41=3,\"b\",0))","v":0},{"$f":"IF('S-P表'!S41=1,1,IF('S-P表'!S41=3,\"b\",0))","v":0},{"$f":"IF('S-P表'!T41=1,1,IF('S-P表'!T41=3,\"b\",0))","v":0},{"$f":"IF('S-P表'!U41=1,1,IF('S-P表'!U41=3,\"b\",0))","v":0},{"$f":"IF('S-P表'!V41=1,1,IF('S-P表'!V41=3,\"b\",0))","v":0},{"$f":"IF('S-P表'!W41=1,1,IF('S-P表'!W41=3,\"b\",0))","v":0},{"$f":"IF('S-P表'!X41=1,1,IF('S-P表'!X41=3,\"b\",0))","v":0},{"$f":"IF('S-P表'!Y41=1,1,IF('S-P表'!Y41=3,\"b\",0))","v":0},{"$f":"IF('S-P表'!Z41=1,1,IF('S-P表'!Z41=3,\"b\",0))","v":0},{"$f":"IF('S-P表'!AA41=1,1,IF('S-P表'!AA41=3,\"b\",0))","v":0},{"$f":"IF('S-P表'!AB41=1,1,IF('S-P表'!AB41=3,\"b\",0))","v":0},{"$f":"IF('S-P表'!AC41=1,1,IF('S-P表'!AC41=3,\"b\",0))","v":0},{"$f":"IF('S-P表'!AD41=1,1,IF('S-P表'!AD41=3,\"b\",0))","v":0},{"$f":"IF('S-P表'!AE41=1,1,IF('S-P表'!AE41=3,\"b\",0))","v":0},{"$f":"IF('S-P表'!AF41=1,1,IF('S-P表'!AF41=3,\"b\",0))","v":0},{"$f":"IF('S-P表'!AG41=1,1,IF('S-P表'!AG41=3,\"b\",0))","v":0},{"$f":"IF('S-P表'!AH41=1,1,IF('S-P表'!AH41=3,\"b\",0))","v":0},{"$f":"IF('S-P表'!AI41=1,1,IF('S-P表'!AI41=3,\"b\",0))","v":0},{"$f":"IF('S-P表'!AJ41=1,1,IF('S-P表'!AJ41=3,\"b\",0))","v":0},{"$f":"IF('S-P表'!AK41=1,1,IF('S-P表'!AK41=3,\"b\",0))","v":0},{"$f":"IF('S-P表'!AL41=1,1,IF('S-P表'!AL41=3,\"b\",0))","v":0},{"$f":"IF('S-P表'!AM41=1,1,IF('S-P表'!AM41=3,\"b\",0))","v":0},{"$f":"IF('S-P表'!AN41=1,1,IF('S-P表'!AN41=3,\"b\",0))","v":0},{"$f":"IF('S-P表'!AO41=1,1,IF('S-P表'!AO41=3,\"b\",0))","v":0},{"$f":"IF('S-P表'!AP41=1,1,IF('S-P表'!AP41=3,\"b\",0))","v":0},{"$f":"IF('S-P表'!AQ41=1,1,IF('S-P表'!AQ41=3,\"b\",0))","v":0},{"$f":"SUM(Sheet3!D41:'Sheet3'!AQ41)","v":0}]
[null,null,null,{"$f":"IF('S-P表'!D42=1,1,IF('S-P表'!D42=3,\"b\",0))","v":0},{"$f":"IF('S-P表'!E42=1,1,IF('S-P表'!E42=3,\"b\",0))","v":0},{"$f":"IF('S-P表'!F42=1,1,IF('S-P表'!F42=3,\"b\",0))","v":0},{"$f":"IF('S-P表'!G42=1,1,IF('S-P表'!G42=3,\"b\",0))","v":0},{"$f":"IF('S-P表'!H42=1,1,IF('S-P表'!H42=3,\"b\",0))","v":0},{"$f":"IF('S-P表'!I42=1,1,IF('S-P表'!I42=3,\"b\",0))","v":0},{"$f":"IF('S-P表'!J42=1,1,IF('S-P表'!J42=3,\"b\",0))","v":0},{"$f":"IF('S-P表'!K42=1,1,IF('S-P表'!K42=3,\"b\",0))","v":0},{"$f":"IF('S-P表'!L42=1,1,IF('S-P表'!L42=3,\"b\",0))","v":0},{"$f":"IF('S-P表'!M42=1,1,IF('S-P表'!M42=3,\"b\",0))","v":0},{"$f":"IF('S-P表'!N42=1,1,IF('S-P表'!N42=3,\"b\",0))","v":0},{"$f":"IF('S-P表'!O42=1,1,IF('S-P表'!O42=3,\"b\",0))","v":0},{"$f":"IF('S-P表'!P42=1,1,IF('S-P表'!P42=3,\"b\",0))","v":0},{"$f":"IF('S-P表'!Q42=1,1,IF('S-P表'!Q42=3,\"b\",0))","v":0},{"$f":"IF('S-P表'!R42=1,1,IF('S-P表'!R42=3,\"b\",0))","v":0},{"$f":"IF('S-P表'!S42=1,1,IF('S-P表'!S42=3,\"b\",0))","v":0},{"$f":"IF('S-P表'!T42=1,1,IF('S-P表'!T42=3,\"b\",0))","v":0},{"$f":"IF('S-P表'!U42=1,1,IF('S-P表'!U42=3,\"b\",0))","v":0},{"$f":"IF('S-P表'!V42=1,1,IF('S-P表'!V42=3,\"b\",0))","v":0},{"$f":"IF('S-P表'!W42=1,1,IF('S-P表'!W42=3,\"b\",0))","v":0},{"$f":"IF('S-P表'!X42=1,1,IF('S-P表'!X42=3,\"b\",0))","v":0},{"$f":"IF('S-P表'!Y42=1,1,IF('S-P表'!Y42=3,\"b\",0))","v":0},{"$f":"IF('S-P表'!Z42=1,1,IF('S-P表'!Z42=3,\"b\",0))","v":0},{"$f":"IF('S-P表'!AA42=1,1,IF('S-P表'!AA42=3,\"b\",0))","v":0},{"$f":"IF('S-P表'!AB42=1,1,IF('S-P表'!AB42=3,\"b\",0))","v":0},{"$f":"IF('S-P表'!AC42=1,1,IF('S-P表'!AC42=3,\"b\",0))","v":0},{"$f":"IF('S-P表'!AD42=1,1,IF('S-P表'!AD42=3,\"b\",0))","v":0},{"$f":"IF('S-P表'!AE42=1,1,IF('S-P表'!AE42=3,\"b\",0))","v":0},{"$f":"IF('S-P表'!AF42=1,1,IF('S-P表'!AF42=3,\"b\",0))","v":0},{"$f":"IF('S-P表'!AG42=1,1,IF('S-P表'!AG42=3,\"b\",0))","v":0},{"$f":"IF('S-P表'!AH42=1,1,IF('S-P表'!AH42=3,\"b\",0))","v":0},{"$f":"IF('S-P表'!AI42=1,1,IF('S-P表'!AI42=3,\"b\",0))","v":0},{"$f":"IF('S-P表'!AJ42=1,1,IF('S-P表'!AJ42=3,\"b\",0))","v":0},{"$f":"IF('S-P表'!AK42=1,1,IF('S-P表'!AK42=3,\"b\",0))","v":0},{"$f":"IF('S-P表'!AL42=1,1,IF('S-P表'!AL42=3,\"b\",0))","v":0},{"$f":"IF('S-P表'!AM42=1,1,IF('S-P表'!AM42=3,\"b\",0))","v":0},{"$f":"IF('S-P表'!AN42=1,1,IF('S-P表'!AN42=3,\"b\",0))","v":0},{"$f":"IF('S-P表'!AO42=1,1,IF('S-P表'!AO42=3,\"b\",0))","v":0},{"$f":"IF('S-P表'!AP42=1,1,IF('S-P表'!AP42=3,\"b\",0))","v":0},{"$f":"IF('S-P表'!AQ42=1,1,IF('S-P表'!AQ42=3,\"b\",0))","v":0},{"$f":"SUM(Sheet3!D42:'Sheet3'!AQ42)","v":0}]
[null,null,null,{"$f":"IF('S-P表'!D43=1,1,IF('S-P表'!D43=3,\"b\",0))","v":0},{"$f":"IF('S-P表'!E43=1,1,IF('S-P表'!E43=3,\"b\",0))","v":0},{"$f":"IF('S-P表'!F43=1,1,IF('S-P表'!F43=3,\"b\",0))","v":0},{"$f":"IF('S-P表'!G43=1,1,IF('S-P表'!G43=3,\"b\",0))","v":0},{"$f":"IF('S-P表'!H43=1,1,IF('S-P表'!H43=3,\"b\",0))","v":0},{"$f":"IF('S-P表'!I43=1,1,IF('S-P表'!I43=3,\"b\",0))","v":0},{"$f":"IF('S-P表'!J43=1,1,IF('S-P表'!J43=3,\"b\",0))","v":0},{"$f":"IF('S-P表'!K43=1,1,IF('S-P表'!K43=3,\"b\",0))","v":0},{"$f":"IF('S-P表'!L43=1,1,IF('S-P表'!L43=3,\"b\",0))","v":0},{"$f":"IF('S-P表'!M43=1,1,IF('S-P表'!M43=3,\"b\",0))","v":0},{"$f":"IF('S-P表'!N43=1,1,IF('S-P表'!N43=3,\"b\",0))","v":0},{"$f":"IF('S-P表'!O43=1,1,IF('S-P表'!O43=3,\"b\",0))","v":0},{"$f":"IF('S-P表'!P43=1,1,IF('S-P表'!P43=3,\"b\",0))","v":0},{"$f":"IF('S-P表'!Q43=1,1,IF('S-P表'!Q43=3,\"b\",0))","v":0},{"$f":"IF('S-P表'!R43=1,1,IF('S-P表'!R43=3,\"b\",0))","v":0},{"$f":"IF('S-P表'!S43=1,1,IF('S-P表'!S43=3,\"b\",0))","v":0},{"$f":"IF('S-P表'!T43=1,1,IF('S-P表'!T43=3,\"b\",0))","v":0},{"$f":"IF('S-P表'!U43=1,1,IF('S-P表'!U43=3,\"b\",0))","v":0},{"$f":"IF('S-P表'!V43=1,1,IF('S-P表'!V43=3,\"b\",0))","v":0},{"$f":"IF('S-P表'!W43=1,1,IF('S-P表'!W43=3,\"b\",0))","v":0},{"$f":"IF('S-P表'!X43=1,1,IF('S-P表'!X43=3,\"b\",0))","v":0},{"$f":"IF('S-P表'!Y43=1,1,IF('S-P表'!Y43=3,\"b\",0))","v":0},{"$f":"IF('S-P表'!Z43=1,1,IF('S-P表'!Z43=3,\"b\",0))","v":0},{"$f":"IF('S-P表'!AA43=1,1,IF('S-P表'!AA43=3,\"b\",0))","v":0},{"$f":"IF('S-P表'!AB43=1,1,IF('S-P表'!AB43=3,\"b\",0))","v":0},{"$f":"IF('S-P表'!AC43=1,1,IF('S-P表'!AC43=3,\"b\",0))","v":0},{"$f":"IF('S-P表'!AD43=1,1,IF('S-P表'!AD43=3,\"b\",0))","v":0},{"$f":"IF('S-P表'!AE43=1,1,IF('S-P表'!AE43=3,\"b\",0))","v":0},{"$f":"IF('S-P表'!AF43=1,1,IF('S-P表'!AF43=3,\"b\",0))","v":0},{"$f":"IF('S-P表'!AG43=1,1,IF('S-P表'!AG43=3,\"b\",0))","v":0},{"$f":"IF('S-P表'!AH43=1,1,IF('S-P表'!AH43=3,\"b\",0))","v":0},{"$f":"IF('S-P表'!AI43=1,1,IF('S-P表'!AI43=3,\"b\",0))","v":0},{"$f":"IF('S-P表'!AJ43=1,1,IF('S-P表'!AJ43=3,\"b\",0))","v":0},{"$f":"IF('S-P表'!AK43=1,1,IF('S-P表'!AK43=3,\"b\",0))","v":0},{"$f":"IF('S-P表'!AL43=1,1,IF('S-P表'!AL43=3,\"b\",0))","v":0},{"$f":"IF('S-P表'!AM43=1,1,IF('S-P表'!AM43=3,\"b\",0))","v":0},{"$f":"IF('S-P表'!AN43=1,1,IF('S-P表'!AN43=3,\"b\",0))","v":0},{"$f":"IF('S-P表'!AO43=1,1,IF('S-P表'!AO43=3,\"b\",0))","v":0},{"$f":"IF('S-P表'!AP43=1,1,IF('S-P表'!AP43=3,\"b\",0))","v":0},{"$f":"IF('S-P表'!AQ43=1,1,IF('S-P表'!AQ43=3,\"b\",0))","v":0},{"$f":"SUM(Sheet3!D43:'Sheet3'!AQ43)","v":0}]
[null,null,null,{"$f":"IF('S-P表'!D44=1,1,IF('S-P表'!D44=3,\"b\",0))","v":0},{"$f":"IF('S-P表'!E44=1,1,IF('S-P表'!E44=3,\"b\",0))","v":0},{"$f":"IF('S-P表'!F44=1,1,IF('S-P表'!F44=3,\"b\",0))","v":0},{"$f":"IF('S-P表'!G44=1,1,IF('S-P表'!G44=3,\"b\",0))","v":0},{"$f":"IF('S-P表'!H44=1,1,IF('S-P表'!H44=3,\"b\",0))","v":0},{"$f":"IF('S-P表'!I44=1,1,IF('S-P表'!I44=3,\"b\",0))","v":0},{"$f":"IF('S-P表'!J44=1,1,IF('S-P表'!J44=3,\"b\",0))","v":0},{"$f":"IF('S-P表'!K44=1,1,IF('S-P表'!K44=3,\"b\",0))","v":0},{"$f":"IF('S-P表'!L44=1,1,IF('S-P表'!L44=3,\"b\",0))","v":0},{"$f":"IF('S-P表'!M44=1,1,IF('S-P表'!M44=3,\"b\",0))","v":0},{"$f":"IF('S-P表'!N44=1,1,IF('S-P表'!N44=3,\"b\",0))","v":0},{"$f":"IF('S-P表'!O44=1,1,IF('S-P表'!O44=3,\"b\",0))","v":0},{"$f":"IF('S-P表'!P44=1,1,IF('S-P表'!P44=3,\"b\",0))","v":0},{"$f":"IF('S-P表'!Q44=1,1,IF('S-P表'!Q44=3,\"b\",0))","v":0},{"$f":"IF('S-P表'!R44=1,1,IF('S-P表'!R44=3,\"b\",0))","v":0},{"$f":"IF('S-P表'!S44=1,1,IF('S-P表'!S44=3,\"b\",0))","v":0},{"$f":"IF('S-P表'!T44=1,1,IF('S-P表'!T44=3,\"b\",0))","v":0},{"$f":"IF('S-P表'!U44=1,1,IF('S-P表'!U44=3,\"b\",0))","v":0},{"$f":"IF('S-P表'!V44=1,1,IF('S-P表'!V44=3,\"b\",0))","v":0},{"$f":"IF('S-P表'!W44=1,1,IF('S-P表'!W44=3,\"b\",0))","v":0},{"$f":"IF('S-P表'!X44=1,1,IF('S-P表'!X44=3,\"b\",0))","v":0},{"$f":"IF('S-P表'!Y44=1,1,IF('S-P表'!Y44=3,\"b\",0))","v":0},{"$f":"IF('S-P表'!Z44=1,1,IF('S-P表'!Z44=3,\"b\",0))","v":0},{"$f":"IF('S-P表'!AA44=1,1,IF('S-P表'!AA44=3,\"b\",0))","v":0},{"$f":"IF('S-P表'!AB44=1,1,IF('S-P表'!AB44=3,\"b\",0))","v":0},{"$f":"IF('S-P表'!AC44=1,1,IF('S-P表'!AC44=3,\"b\",0))","v":0},{"$f":"IF('S-P表'!AD44=1,1,IF('S-P表'!AD44=3,\"b\",0))","v":0},{"$f":"IF('S-P表'!AE44=1,1,IF('S-P表'!AE44=3,\"b\",0))","v":0},{"$f":"IF('S-P表'!AF44=1,1,IF('S-P表'!AF44=3,\"b\",0))","v":0},{"$f":"IF('S-P表'!AG44=1,1,IF('S-P表'!AG44=3,\"b\",0))","v":0},{"$f":"IF('S-P表'!AH44=1,1,IF('S-P表'!AH44=3,\"b\",0))","v":0},{"$f":"IF('S-P表'!AI44=1,1,IF('S-P表'!AI44=3,\"b\",0))","v":0},{"$f":"IF('S-P表'!AJ44=1,1,IF('S-P表'!AJ44=3,\"b\",0))","v":0},{"$f":"IF('S-P表'!AK44=1,1,IF('S-P表'!AK44=3,\"b\",0))","v":0},{"$f":"IF('S-P表'!AL44=1,1,IF('S-P表'!AL44=3,\"b\",0))","v":0},{"$f":"IF('S-P表'!AM44=1,1,IF('S-P表'!AM44=3,\"b\",0))","v":0},{"$f":"IF('S-P表'!AN44=1,1,IF('S-P表'!AN44=3,\"b\",0))","v":0},{"$f":"IF('S-P表'!AO44=1,1,IF('S-P表'!AO44=3,\"b\",0))","v":0},{"$f":"IF('S-P表'!AP44=1,1,IF('S-P表'!AP44=3,\"b\",0))","v":0},{"$f":"IF('S-P表'!AQ44=1,1,IF('S-P表'!AQ44=3,\"b\",0))","v":0},{"$f":"SUM(Sheet3!D44:'Sheet3'!AQ44)","v":0}]
[null,null,null,{"$f":"IF('S-P表'!D45=1,1,IF('S-P表'!D45=3,\"b\",0))","v":0},{"$f":"IF('S-P表'!E45=1,1,IF('S-P表'!E45=3,\"b\",0))","v":0},{"$f":"IF('S-P表'!F45=1,1,IF('S-P表'!F45=3,\"b\",0))","v":0},{"$f":"IF('S-P表'!G45=1,1,IF('S-P表'!G45=3,\"b\",0))","v":0},{"$f":"IF('S-P表'!H45=1,1,IF('S-P表'!H45=3,\"b\",0))","v":0},{"$f":"IF('S-P表'!I45=1,1,IF('S-P表'!I45=3,\"b\",0))","v":0},{"$f":"IF('S-P表'!J45=1,1,IF('S-P表'!J45=3,\"b\",0))","v":0},{"$f":"IF('S-P表'!K45=1,1,IF('S-P表'!K45=3,\"b\",0))","v":0},{"$f":"IF('S-P表'!L45=1,1,IF('S-P表'!L45=3,\"b\",0))","v":0},{"$f":"IF('S-P表'!M45=1,1,IF('S-P表'!M45=3,\"b\",0))","v":0},{"$f":"IF('S-P表'!N45=1,1,IF('S-P表'!N45=3,\"b\",0))","v":0},{"$f":"IF('S-P表'!O45=1,1,IF('S-P表'!O45=3,\"b\",0))","v":0},{"$f":"IF('S-P表'!P45=1,1,IF('S-P表'!P45=3,\"b\",0))","v":0},{"$f":"IF('S-P表'!Q45=1,1,IF('S-P表'!Q45=3,\"b\",0))","v":0},{"$f":"IF('S-P表'!R45=1,1,IF('S-P表'!R45=3,\"b\",0))","v":0},{"$f":"IF('S-P表'!S45=1,1,IF('S-P表'!S45=3,\"b\",0))","v":0},{"$f":"IF('S-P表'!T45=1,1,IF('S-P表'!T45=3,\"b\",0))","v":0},{"$f":"IF('S-P表'!U45=1,1,IF('S-P表'!U45=3,\"b\",0))","v":0},{"$f":"IF('S-P表'!V45=1,1,IF('S-P表'!V45=3,\"b\",0))","v":0},{"$f":"IF('S-P表'!W45=1,1,IF('S-P表'!W45=3,\"b\",0))","v":0},{"$f":"IF('S-P表'!X45=1,1,IF('S-P表'!X45=3,\"b\",0))","v":0},{"$f":"IF('S-P表'!Y45=1,1,IF('S-P表'!Y45=3,\"b\",0))","v":0},{"$f":"IF('S-P表'!Z45=1,1,IF('S-P表'!Z45=3,\"b\",0))","v":0},{"$f":"IF('S-P表'!AA45=1,1,IF('S-P表'!AA45=3,\"b\",0))","v":0},{"$f":"IF('S-P表'!AB45=1,1,IF('S-P表'!AB45=3,\"b\",0))","v":0},{"$f":"IF('S-P表'!AC45=1,1,IF('S-P表'!AC45=3,\"b\",0))","v":0},{"$f":"IF('S-P表'!AD45=1,1,IF('S-P表'!AD45=3,\"b\",0))","v":0},{"$f":"IF('S-P表'!AE45=1,1,IF('S-P表'!AE45=3,\"b\",0))","v":0},{"$f":"IF('S-P表'!AF45=1,1,IF('S-P表'!AF45=3,\"b\",0))","v":0},{"$f":"IF('S-P表'!AG45=1,1,IF('S-P表'!AG45=3,\"b\",0))","v":0},{"$f":"IF('S-P表'!AH45=1,1,IF('S-P表'!AH45=3,\"b\",0))","v":0},{"$f":"IF('S-P表'!AI45=1,1,IF('S-P表'!AI45=3,\"b\",0))","v":0},{"$f":"IF('S-P表'!AJ45=1,1,IF('S-P表'!AJ45=3,\"b\",0))","v":0},{"$f":"IF('S-P表'!AK45=1,1,IF('S-P表'!AK45=3,\"b\",0))","v":0},{"$f":"IF('S-P表'!AL45=1,1,IF('S-P表'!AL45=3,\"b\",0))","v":0},{"$f":"IF('S-P表'!AM45=1,1,IF('S-P表'!AM45=3,\"b\",0))","v":0},{"$f":"IF('S-P表'!AN45=1,1,IF('S-P表'!AN45=3,\"b\",0))","v":0},{"$f":"IF('S-P表'!AO45=1,1,IF('S-P表'!AO45=3,\"b\",0))","v":0},{"$f":"IF('S-P表'!AP45=1,1,IF('S-P表'!AP45=3,\"b\",0))","v":0},{"$f":"IF('S-P表'!AQ45=1,1,IF('S-P表'!AQ45=3,\"b\",0))","v":0},{"$f":"SUM(Sheet3!D45:'Sheet3'!AQ45)","v":0}]
[null,null,null,{"$f":"IF('S-P表'!D46=1,1,IF('S-P表'!D46=3,\"b\",0))","v":0},{"$f":"IF('S-P表'!E46=1,1,IF('S-P表'!E46=3,\"b\",0))","v":0},{"$f":"IF('S-P表'!F46=1,1,IF('S-P表'!F46=3,\"b\",0))","v":0},{"$f":"IF('S-P表'!G46=1,1,IF('S-P表'!G46=3,\"b\",0))","v":0},{"$f":"IF('S-P表'!H46=1,1,IF('S-P表'!H46=3,\"b\",0))","v":0},{"$f":"IF('S-P表'!I46=1,1,IF('S-P表'!I46=3,\"b\",0))","v":0},{"$f":"IF('S-P表'!J46=1,1,IF('S-P表'!J46=3,\"b\",0))","v":0},{"$f":"IF('S-P表'!K46=1,1,IF('S-P表'!K46=3,\"b\",0))","v":0},{"$f":"IF('S-P表'!L46=1,1,IF('S-P表'!L46=3,\"b\",0))","v":0},{"$f":"IF('S-P表'!M46=1,1,IF('S-P表'!M46=3,\"b\",0))","v":0},{"$f":"IF('S-P表'!N46=1,1,IF('S-P表'!N46=3,\"b\",0))","v":0},{"$f":"IF('S-P表'!O46=1,1,IF('S-P表'!O46=3,\"b\",0))","v":0},{"$f":"IF('S-P表'!P46=1,1,IF('S-P表'!P46=3,\"b\",0))","v":0},{"$f":"IF('S-P表'!Q46=1,1,IF('S-P表'!Q46=3,\"b\",0))","v":0},{"$f":"IF('S-P表'!R46=1,1,IF('S-P表'!R46=3,\"b\",0))","v":0},{"$f":"IF('S-P表'!S46=1,1,IF('S-P表'!S46=3,\"b\",0))","v":0},{"$f":"IF('S-P表'!T46=1,1,IF('S-P表'!T46=3,\"b\",0))","v":0},{"$f":"IF('S-P表'!U46=1,1,IF('S-P表'!U46=3,\"b\",0))","v":0},{"$f":"IF('S-P表'!V46=1,1,IF('S-P表'!V46=3,\"b\",0))","v":0},{"$f":"IF('S-P表'!W46=1,1,IF('S-P表'!W46=3,\"b\",0))","v":0},{"$f":"IF('S-P表'!X46=1,1,IF('S-P表'!X46=3,\"b\",0))","v":0},{"$f":"IF('S-P表'!Y46=1,1,IF('S-P表'!Y46=3,\"b\",0))","v":0},{"$f":"IF('S-P表'!Z46=1,1,IF('S-P表'!Z46=3,\"b\",0))","v":0},{"$f":"IF('S-P表'!AA46=1,1,IF('S-P表'!AA46=3,\"b\",0))","v":0},{"$f":"IF('S-P表'!AB46=1,1,IF('S-P表'!AB46=3,\"b\",0))","v":0},{"$f":"IF('S-P表'!AC46=1,1,IF('S-P表'!AC46=3,\"b\",0))","v":0},{"$f":"IF('S-P表'!AD46=1,1,IF('S-P表'!AD46=3,\"b\",0))","v":0},{"$f":"IF('S-P表'!AE46=1,1,IF('S-P表'!AE46=3,\"b\",0))","v":0},{"$f":"IF('S-P表'!AF46=1,1,IF('S-P表'!AF46=3,\"b\",0))","v":0},{"$f":"IF('S-P表'!AG46=1,1,IF('S-P表'!AG46=3,\"b\",0))","v":0},{"$f":"IF('S-P表'!AH46=1,1,IF('S-P表'!AH46=3,\"b\",0))","v":0},{"$f":"IF('S-P表'!AI46=1,1,IF('S-P表'!AI46=3,\"b\",0))","v":0},{"$f":"IF('S-P表'!AJ46=1,1,IF('S-P表'!AJ46=3,\"b\",0))","v":0},{"$f":"IF('S-P表'!AK46=1,1,IF('S-P表'!AK46=3,\"b\",0))","v":0},{"$f":"IF('S-P表'!AL46=1,1,IF('S-P表'!AL46=3,\"b\",0))","v":0},{"$f":"IF('S-P表'!AM46=1,1,IF('S-P表'!AM46=3,\"b\",0))","v":0},{"$f":"IF('S-P表'!AN46=1,1,IF('S-P表'!AN46=3,\"b\",0))","v":0},{"$f":"IF('S-P表'!AO46=1,1,IF('S-P表'!AO46=3,\"b\",0))","v":0},{"$f":"IF('S-P表'!AP46=1,1,IF('S-P表'!AP46=3,\"b\",0))","v":0},{"$f":"IF('S-P表'!AQ46=1,1,IF('S-P表'!AQ46=3,\"b\",0))","v":0},{"$f":"SUM(Sheet3!D46:'Sheet3'!AQ46)","v":0}]
[null,null,null,{"$f":"IF('S-P表'!D47=1,1,IF('S-P表'!D47=3,\"b\",0))","v":0},{"$f":"IF('S-P表'!E47=1,1,IF('S-P表'!E47=3,\"b\",0))","v":0},{"$f":"IF('S-P表'!F47=1,1,IF('S-P表'!F47=3,\"b\",0))","v":0},{"$f":"IF('S-P表'!G47=1,1,IF('S-P表'!G47=3,\"b\",0))","v":0},{"$f":"IF('S-P表'!H47=1,1,IF('S-P表'!H47=3,\"b\",0))","v":0},{"$f":"IF('S-P表'!I47=1,1,IF('S-P表'!I47=3,\"b\",0))","v":0},{"$f":"IF('S-P表'!J47=1,1,IF('S-P表'!J47=3,\"b\",0))","v":0},{"$f":"IF('S-P表'!K47=1,1,IF('S-P表'!K47=3,\"b\",0))","v":0},{"$f":"IF('S-P表'!L47=1,1,IF('S-P表'!L47=3,\"b\",0))","v":0},{"$f":"IF('S-P表'!M47=1,1,IF('S-P表'!M47=3,\"b\",0))","v":0},{"$f":"IF('S-P表'!N47=1,1,IF('S-P表'!N47=3,\"b\",0))","v":0},{"$f":"IF('S-P表'!O47=1,1,IF('S-P表'!O47=3,\"b\",0))","v":0},{"$f":"IF('S-P表'!P47=1,1,IF('S-P表'!P47=3,\"b\",0))","v":0},{"$f":"IF('S-P表'!Q47=1,1,IF('S-P表'!Q47=3,\"b\",0))","v":0},{"$f":"IF('S-P表'!R47=1,1,IF('S-P表'!R47=3,\"b\",0))","v":0},{"$f":"IF('S-P表'!S47=1,1,IF('S-P表'!S47=3,\"b\",0))","v":0},{"$f":"IF('S-P表'!T47=1,1,IF('S-P表'!T47=3,\"b\",0))","v":0},{"$f":"IF('S-P表'!U47=1,1,IF('S-P表'!U47=3,\"b\",0))","v":0},{"$f":"IF('S-P表'!V47=1,1,IF('S-P表'!V47=3,\"b\",0))","v":0},{"$f":"IF('S-P表'!W47=1,1,IF('S-P表'!W47=3,\"b\",0))","v":0},{"$f":"IF('S-P表'!X47=1,1,IF('S-P表'!X47=3,\"b\",0))","v":0},{"$f":"IF('S-P表'!Y47=1,1,IF('S-P表'!Y47=3,\"b\",0))","v":0},{"$f":"IF('S-P表'!Z47=1,1,IF('S-P表'!Z47=3,\"b\",0))","v":0},{"$f":"IF('S-P表'!AA47=1,1,IF('S-P表'!AA47=3,\"b\",0))","v":0},{"$f":"IF('S-P表'!AB47=1,1,IF('S-P表'!AB47=3,\"b\",0))","v":0},{"$f":"IF('S-P表'!AC47=1,1,IF('S-P表'!AC47=3,\"b\",0))","v":0},{"$f":"IF('S-P表'!AD47=1,1,IF('S-P表'!AD47=3,\"b\",0))","v":0},{"$f":"IF('S-P表'!AE47=1,1,IF('S-P表'!AE47=3,\"b\",0))","v":0},{"$f":"IF('S-P表'!AF47=1,1,IF('S-P表'!AF47=3,\"b\",0))","v":0},{"$f":"IF('S-P表'!AG47=1,1,IF('S-P表'!AG47=3,\"b\",0))","v":0},{"$f":"IF('S-P表'!AH47=1,1,IF('S-P表'!AH47=3,\"b\",0))","v":0},{"$f":"IF('S-P表'!AI47=1,1,IF('S-P表'!AI47=3,\"b\",0))","v":0},{"$f":"IF('S-P表'!AJ47=1,1,IF('S-P表'!AJ47=3,\"b\",0))","v":0},{"$f":"IF('S-P表'!AK47=1,1,IF('S-P表'!AK47=3,\"b\",0))","v":0},{"$f":"IF('S-P表'!AL47=1,1,IF('S-P表'!AL47=3,\"b\",0))","v":0},{"$f":"IF('S-P表'!AM47=1,1,IF('S-P表'!AM47=3,\"b\",0))","v":0},{"$f":"IF('S-P表'!AN47=1,1,IF('S-P表'!AN47=3,\"b\",0))","v":0},{"$f":"IF('S-P表'!AO47=1,1,IF('S-P表'!AO47=3,\"b\",0))","v":0},{"$f":"IF('S-P表'!AP47=1,1,IF('S-P表'!AP47=3,\"b\",0))","v":0},{"$f":"IF('S-P表'!AQ47=1,1,IF('S-P表'!AQ47=3,\"b\",0))","v":0},{"$f":"SUM(Sheet3!D47:'Sheet3'!AQ47)","v":0}]
[null,null,null,{"$f":"IF('S-P表'!D48=1,1,IF('S-P表'!D48=3,\"b\",0))","v":0},{"$f":"IF('S-P表'!E48=1,1,IF('S-P表'!E48=3,\"b\",0))","v":0},{"$f":"IF('S-P表'!F48=1,1,IF('S-P表'!F48=3,\"b\",0))","v":0},{"$f":"IF('S-P表'!G48=1,1,IF('S-P表'!G48=3,\"b\",0))","v":0},{"$f":"IF('S-P表'!H48=1,1,IF('S-P表'!H48=3,\"b\",0))","v":0},{"$f":"IF('S-P表'!I48=1,1,IF('S-P表'!I48=3,\"b\",0))","v":0},{"$f":"IF('S-P表'!J48=1,1,IF('S-P表'!J48=3,\"b\",0))","v":0},{"$f":"IF('S-P表'!K48=1,1,IF('S-P表'!K48=3,\"b\",0))","v":0},{"$f":"IF('S-P表'!L48=1,1,IF('S-P表'!L48=3,\"b\",0))","v":0},{"$f":"IF('S-P表'!M48=1,1,IF('S-P表'!M48=3,\"b\",0))","v":0},{"$f":"IF('S-P表'!N48=1,1,IF('S-P表'!N48=3,\"b\",0))","v":0},{"$f":"IF('S-P表'!O48=1,1,IF('S-P表'!O48=3,\"b\",0))","v":0},{"$f":"IF('S-P表'!P48=1,1,IF('S-P表'!P48=3,\"b\",0))","v":0},{"$f":"IF('S-P表'!Q48=1,1,IF('S-P表'!Q48=3,\"b\",0))","v":0},{"$f":"IF('S-P表'!R48=1,1,IF('S-P表'!R48=3,\"b\",0))","v":0},{"$f":"IF('S-P表'!S48=1,1,IF('S-P表'!S48=3,\"b\",0))","v":0},{"$f":"IF('S-P表'!T48=1,1,IF('S-P表'!T48=3,\"b\",0))","v":0},{"$f":"IF('S-P表'!U48=1,1,IF('S-P表'!U48=3,\"b\",0))","v":0},{"$f":"IF('S-P表'!V48=1,1,IF('S-P表'!V48=3,\"b\",0))","v":0},{"$f":"IF('S-P表'!W48=1,1,IF('S-P表'!W48=3,\"b\",0))","v":0},{"$f":"IF('S-P表'!X48=1,1,IF('S-P表'!X48=3,\"b\",0))","v":0},{"$f":"IF('S-P表'!Y48=1,1,IF('S-P表'!Y48=3,\"b\",0))","v":0},{"$f":"IF('S-P表'!Z48=1,1,IF('S-P表'!Z48=3,\"b\",0))","v":0},{"$f":"IF('S-P表'!AA48=1,1,IF('S-P表'!AA48=3,\"b\",0))","v":0},{"$f":"IF('S-P表'!AB48=1,1,IF('S-P表'!AB48=3,\"b\",0))","v":0},{"$f":"IF('S-P表'!AC48=1,1,IF('S-P表'!AC48=3,\"b\",0))","v":0},{"$f":"IF('S-P表'!AD48=1,1,IF('S-P表'!AD48=3,\"b\",0))","v":0},{"$f":"IF('S-P表'!AE48=1,1,IF('S-P表'!AE48=3,\"b\",0))","v":0},{"$f":"IF('S-P表'!AF48=1,1,IF('S-P表'!AF48=3,\"b\",0))","v":0},{"$f":"IF('S-P表'!AG48=1,1,IF('S-P表'!AG48=3,\"b\",0))","v":0},{"$f":"IF('S-P表'!AH48=1,1,IF('S-P表'!AH48=3,\"b\",0))","v":0},{"$f":"IF('S-P表'!AI48=1,1,IF('S-P表'!AI48=3,\"b\",0))","v":0},{"$f":"IF('S-P表'!AJ48=1,1,IF('S-P表'!AJ48=3,\"b\",0))","v":0},{"$f":"IF('S-P表'!AK48=1,1,IF('S-P表'!AK48=3,\"b\",0))","v":0},{"$f":"IF('S-P表'!AL48=1,1,IF('S-P表'!AL48=3,\"b\",0))","v":0},{"$f":"IF('S-P表'!AM48=1,1,IF('S-P表'!AM48=3,\"b\",0))","v":0},{"$f":"IF('S-P表'!AN48=1,1,IF('S-P表'!AN48=3,\"b\",0))","v":0},{"$f":"IF('S-P表'!AO48=1,1,IF('S-P表'!AO48=3,\"b\",0))","v":0},{"$f":"IF('S-P表'!AP48=1,1,IF('S-P表'!AP48=3,\"b\",0))","v":0},{"$f":"IF('S-P表'!AQ48=1,1,IF('S-P表'!AQ48=3,\"b\",0))","v":0},{"$f":"SUM(Sheet3!D48:'Sheet3'!AQ48)","v":0}]
[null,null,null,{"$f":"IF('S-P表'!D49=1,1,IF('S-P表'!D49=3,\"b\",0))","v":0},{"$f":"IF('S-P表'!E49=1,1,IF('S-P表'!E49=3,\"b\",0))","v":0},{"$f":"IF('S-P表'!F49=1,1,IF('S-P表'!F49=3,\"b\",0))","v":0},{"$f":"IF('S-P表'!G49=1,1,IF('S-P表'!G49=3,\"b\",0))","v":0},{"$f":"IF('S-P表'!H49=1,1,IF('S-P表'!H49=3,\"b\",0))","v":0},{"$f":"IF('S-P表'!I49=1,1,IF('S-P表'!I49=3,\"b\",0))","v":0},{"$f":"IF('S-P表'!J49=1,1,IF('S-P表'!J49=3,\"b\",0))","v":0},{"$f":"IF('S-P表'!K49=1,1,IF('S-P表'!K49=3,\"b\",0))","v":0},{"$f":"IF('S-P表'!L49=1,1,IF('S-P表'!L49=3,\"b\",0))","v":0},{"$f":"IF('S-P表'!M49=1,1,IF('S-P表'!M49=3,\"b\",0))","v":0},{"$f":"IF('S-P表'!N49=1,1,IF('S-P表'!N49=3,\"b\",0))","v":0},{"$f":"IF('S-P表'!O49=1,1,IF('S-P表'!O49=3,\"b\",0))","v":0},{"$f":"IF('S-P表'!P49=1,1,IF('S-P表'!P49=3,\"b\",0))","v":0},{"$f":"IF('S-P表'!Q49=1,1,IF('S-P表'!Q49=3,\"b\",0))","v":0},{"$f":"IF('S-P表'!R49=1,1,IF('S-P表'!R49=3,\"b\",0))","v":0},{"$f":"IF('S-P表'!S49=1,1,IF('S-P表'!S49=3,\"b\",0))","v":0},{"$f":"IF('S-P表'!T49=1,1,IF('S-P表'!T49=3,\"b\",0))","v":0},{"$f":"IF('S-P表'!U49=1,1,IF('S-P表'!U49=3,\"b\",0))","v":0},{"$f":"IF('S-P表'!V49=1,1,IF('S-P表'!V49=3,\"b\",0))","v":0},{"$f":"IF('S-P表'!W49=1,1,IF('S-P表'!W49=3,\"b\",0))","v":0},{"$f":"IF('S-P表'!X49=1,1,IF('S-P表'!X49=3,\"b\",0))","v":0},{"$f":"IF('S-P表'!Y49=1,1,IF('S-P表'!Y49=3,\"b\",0))","v":0},{"$f":"IF('S-P表'!Z49=1,1,IF('S-P表'!Z49=3,\"b\",0))","v":0},{"$f":"IF('S-P表'!AA49=1,1,IF('S-P表'!AA49=3,\"b\",0))","v":0},{"$f":"IF('S-P表'!AB49=1,1,IF('S-P表'!AB49=3,\"b\",0))","v":0},{"$f":"IF('S-P表'!AC49=1,1,IF('S-P表'!AC49=3,\"b\",0))","v":0},{"$f":"IF('S-P表'!AD49=1,1,IF('S-P表'!AD49=3,\"b\",0))","v":0},{"$f":"IF('S-P表'!AE49=1,1,IF('S-P表'!AE49=3,\"b\",0))","v":0},{"$f":"IF('S-P表'!AF49=1,1,IF('S-P表'!AF49=3,\"b\",0))","v":0},{"$f":"IF('S-P表'!AG49=1,1,IF('S-P表'!AG49=3,\"b\",0))","v":0},{"$f":"IF('S-P表'!AH49=1,1,IF('S-P表'!AH49=3,\"b\",0))","v":0},{"$f":"IF('S-P表'!AI49=1,1,IF('S-P表'!AI49=3,\"b\",0))","v":0},{"$f":"IF('S-P表'!AJ49=1,1,IF('S-P表'!AJ49=3,\"b\",0))","v":0},{"$f":"IF('S-P表'!AK49=1,1,IF('S-P表'!AK49=3,\"b\",0))","v":0},{"$f":"IF('S-P表'!AL49=1,1,IF('S-P表'!AL49=3,\"b\",0))","v":0},{"$f":"IF('S-P表'!AM49=1,1,IF('S-P表'!AM49=3,\"b\",0))","v":0},{"$f":"IF('S-P表'!AN49=1,1,IF('S-P表'!AN49=3,\"b\",0))","v":0},{"$f":"IF('S-P表'!AO49=1,1,IF('S-P表'!AO49=3,\"b\",0))","v":0},{"$f":"IF('S-P表'!AP49=1,1,IF('S-P表'!AP49=3,\"b\",0))","v":0},{"$f":"IF('S-P表'!AQ49=1,1,IF('S-P表'!AQ49=3,\"b\",0))","v":0},{"$f":"SUM(Sheet3!D49:'Sheet3'!AQ49)","v":0}]
[null,null,null,{"$f":"IF('S-P表'!D50=1,1,IF('S-P表'!D50=3,\"b\",0))","v":0},{"$f":"IF('S-P表'!E50=1,1,IF('S-P表'!E50=3,\"b\",0))","v":0},{"$f":"IF('S-P表'!F50=1,1,IF('S-P表'!F50=3,\"b\",0))","v":0},{"$f":"IF('S-P表'!G50=1,1,IF('S-P表'!G50=3,\"b\",0))","v":0},{"$f":"IF('S-P表'!H50=1,1,IF('S-P表'!H50=3,\"b\",0))","v":0},{"$f":"IF('S-P表'!I50=1,1,IF('S-P表'!I50=3,\"b\",0))","v":0},{"$f":"IF('S-P表'!J50=1,1,IF('S-P表'!J50=3,\"b\",0))","v":0},{"$f":"IF('S-P表'!K50=1,1,IF('S-P表'!K50=3,\"b\",0))","v":0},{"$f":"IF('S-P表'!L50=1,1,IF('S-P表'!L50=3,\"b\",0))","v":0},{"$f":"IF('S-P表'!M50=1,1,IF('S-P表'!M50=3,\"b\",0))","v":0},{"$f":"IF('S-P表'!N50=1,1,IF('S-P表'!N50=3,\"b\",0))","v":0},{"$f":"IF('S-P表'!O50=1,1,IF('S-P表'!O50=3,\"b\",0))","v":0},{"$f":"IF('S-P表'!P50=1,1,IF('S-P表'!P50=3,\"b\",0))","v":0},{"$f":"IF('S-P表'!Q50=1,1,IF('S-P表'!Q50=3,\"b\",0))","v":0},{"$f":"IF('S-P表'!R50=1,1,IF('S-P表'!R50=3,\"b\",0))","v":0},{"$f":"IF('S-P表'!S50=1,1,IF('S-P表'!S50=3,\"b\",0))","v":0},{"$f":"IF('S-P表'!T50=1,1,IF('S-P表'!T50=3,\"b\",0))","v":0},{"$f":"IF('S-P表'!U50=1,1,IF('S-P表'!U50=3,\"b\",0))","v":0},{"$f":"IF('S-P表'!V50=1,1,IF('S-P表'!V50=3,\"b\",0))","v":0},{"$f":"IF('S-P表'!W50=1,1,IF('S-P表'!W50=3,\"b\",0))","v":0},{"$f":"IF('S-P表'!X50=1,1,IF('S-P表'!X50=3,\"b\",0))","v":0},{"$f":"IF('S-P表'!Y50=1,1,IF('S-P表'!Y50=3,\"b\",0))","v":0},{"$f":"IF('S-P表'!Z50=1,1,IF('S-P表'!Z50=3,\"b\",0))","v":0},{"$f":"IF('S-P表'!AA50=1,1,IF('S-P表'!AA50=3,\"b\",0))","v":0},{"$f":"IF('S-P表'!AB50=1,1,IF('S-P表'!AB50=3,\"b\",0))","v":0},{"$f":"IF('S-P表'!AC50=1,1,IF('S-P表'!AC50=3,\"b\",0))","v":0},{"$f":"IF('S-P表'!AD50=1,1,IF('S-P表'!AD50=3,\"b\",0))","v":0},{"$f":"IF('S-P表'!AE50=1,1,IF('S-P表'!AE50=3,\"b\",0))","v":0},{"$f":"IF('S-P表'!AF50=1,1,IF('S-P表'!AF50=3,\"b\",0))","v":0},{"$f":"IF('S-P表'!AG50=1,1,IF('S-P表'!AG50=3,\"b\",0))","v":0},{"$f":"IF('S-P表'!AH50=1,1,IF('S-P表'!AH50=3,\"b\",0))","v":0},{"$f":"IF('S-P表'!AI50=1,1,IF('S-P表'!AI50=3,\"b\",0))","v":0},{"$f":"IF('S-P表'!AJ50=1,1,IF('S-P表'!AJ50=3,\"b\",0))","v":0},{"$f":"IF('S-P表'!AK50=1,1,IF('S-P表'!AK50=3,\"b\",0))","v":0},{"$f":"IF('S-P表'!AL50=1,1,IF('S-P表'!AL50=3,\"b\",0))","v":0},{"$f":"IF('S-P表'!AM50=1,1,IF('S-P表'!AM50=3,\"b\",0))","v":0},{"$f":"IF('S-P表'!AN50=1,1,IF('S-P表'!AN50=3,\"b\",0))","v":0},{"$f":"IF('S-P表'!AO50=1,1,IF('S-P表'!AO50=3,\"b\",0))","v":0},{"$f":"IF('S-P表'!AP50=1,1,IF('S-P表'!AP50=3,\"b\",0))","v":0},{"$f":"IF('S-P表'!AQ50=1,1,IF('S-P表'!AQ50=3,\"b\",0))","v":0},{"$f":"SUM(Sheet3!D50:'Sheet3'!AQ50)","v":0}]
[null,null,null,{"$f":"IF('S-P表'!D51=1,1,IF('S-P表'!D51=3,\"b\",0))","v":0},{"$f":"IF('S-P表'!E51=1,1,IF('S-P表'!E51=3,\"b\",0))","v":0},{"$f":"IF('S-P表'!F51=1,1,IF('S-P表'!F51=3,\"b\",0))","v":0},{"$f":"IF('S-P表'!G51=1,1,IF('S-P表'!G51=3,\"b\",0))","v":0},{"$f":"IF('S-P表'!H51=1,1,IF('S-P表'!H51=3,\"b\",0))","v":0},{"$f":"IF('S-P表'!I51=1,1,IF('S-P表'!I51=3,\"b\",0))","v":0},{"$f":"IF('S-P表'!J51=1,1,IF('S-P表'!J51=3,\"b\",0))","v":0},{"$f":"IF('S-P表'!K51=1,1,IF('S-P表'!K51=3,\"b\",0))","v":0},{"$f":"IF('S-P表'!L51=1,1,IF('S-P表'!L51=3,\"b\",0))","v":0},{"$f":"IF('S-P表'!M51=1,1,IF('S-P表'!M51=3,\"b\",0))","v":0},{"$f":"IF('S-P表'!N51=1,1,IF('S-P表'!N51=3,\"b\",0))","v":0},{"$f":"IF('S-P表'!O51=1,1,IF('S-P表'!O51=3,\"b\",0))","v":0},{"$f":"IF('S-P表'!P51=1,1,IF('S-P表'!P51=3,\"b\",0))","v":0},{"$f":"IF('S-P表'!Q51=1,1,IF('S-P表'!Q51=3,\"b\",0))","v":0},{"$f":"IF('S-P表'!R51=1,1,IF('S-P表'!R51=3,\"b\",0))","v":0},{"$f":"IF('S-P表'!S51=1,1,IF('S-P表'!S51=3,\"b\",0))","v":0},{"$f":"IF('S-P表'!T51=1,1,IF('S-P表'!T51=3,\"b\",0))","v":0},{"$f":"IF('S-P表'!U51=1,1,IF('S-P表'!U51=3,\"b\",0))","v":0},{"$f":"IF('S-P表'!V51=1,1,IF('S-P表'!V51=3,\"b\",0))","v":0},{"$f":"IF('S-P表'!W51=1,1,IF('S-P表'!W51=3,\"b\",0))","v":0},{"$f":"IF('S-P表'!X51=1,1,IF('S-P表'!X51=3,\"b\",0))","v":0},{"$f":"IF('S-P表'!Y51=1,1,IF('S-P表'!Y51=3,\"b\",0))","v":0},{"$f":"IF('S-P表'!Z51=1,1,IF('S-P表'!Z51=3,\"b\",0))","v":0},{"$f":"IF('S-P表'!AA51=1,1,IF('S-P表'!AA51=3,\"b\",0))","v":0},{"$f":"IF('S-P表'!AB51=1,1,IF('S-P表'!AB51=3,\"b\",0))","v":0},{"$f":"IF('S-P表'!AC51=1,1,IF('S-P表'!AC51=3,\"b\",0))","v":0},{"$f":"IF('S-P表'!AD51=1,1,IF('S-P表'!AD51=3,\"b\",0))","v":0},{"$f":"IF('S-P表'!AE51=1,1,IF('S-P表'!AE51=3,\"b\",0))","v":0},{"$f":"IF('S-P表'!AF51=1,1,IF('S-P表'!AF51=3,\"b\",0))","v":0},{"$f":"IF('S-P表'!AG51=1,1,IF('S-P表'!AG51=3,\"b\",0))","v":0},{"$f":"IF('S-P表'!AH51=1,1,IF('S-P表'!AH51=3,\"b\",0))","v":0},{"$f":"IF('S-P表'!AI51=1,1,IF('S-P表'!AI51=3,\"b\",0))","v":0},{"$f":"IF('S-P表'!AJ51=1,1,IF('S-P表'!AJ51=3,\"b\",0))","v":0},{"$f":"IF('S-P表'!AK51=1,1,IF('S-P表'!AK51=3,\"b\",0))","v":0},{"$f":"IF('S-P表'!AL51=1,1,IF('S-P表'!AL51=3,\"b\",0))","v":0},{"$f":"IF('S-P表'!AM51=1,1,IF('S-P表'!AM51=3,\"b\",0))","v":0},{"$f":"IF('S-P表'!AN51=1,1,IF('S-P表'!AN51=3,\"b\",0))","v":0},{"$f":"IF('S-P表'!AO51=1,1,IF('S-P表'!AO51=3,\"b\",0))","v":0},{"$f":"IF('S-P表'!AP51=1,1,IF('S-P表'!AP51=3,\"b\",0))","v":0},{"$f":"IF('S-P表'!AQ51=1,1,IF('S-P表'!AQ51=3,\"b\",0))","v":0},{"$f":"SUM(Sheet3!D51:'Sheet3'!AQ51)","v":0}]
[null,null,null,{"$f":"IF('S-P表'!D52=1,1,IF('S-P表'!D52=3,\"b\",0))","v":0},{"$f":"IF('S-P表'!E52=1,1,IF('S-P表'!E52=3,\"b\",0))","v":0},{"$f":"IF('S-P表'!F52=1,1,IF('S-P表'!F52=3,\"b\",0))","v":0},{"$f":"IF('S-P表'!G52=1,1,IF('S-P表'!G52=3,\"b\",0))","v":0},{"$f":"IF('S-P表'!H52=1,1,IF('S-P表'!H52=3,\"b\",0))","v":0},{"$f":"IF('S-P表'!I52=1,1,IF('S-P表'!I52=3,\"b\",0))","v":0},{"$f":"IF('S-P表'!J52=1,1,IF('S-P表'!J52=3,\"b\",0))","v":0},{"$f":"IF('S-P表'!K52=1,1,IF('S-P表'!K52=3,\"b\",0))","v":0},{"$f":"IF('S-P表'!L52=1,1,IF('S-P表'!L52=3,\"b\",0))","v":0},{"$f":"IF('S-P表'!M52=1,1,IF('S-P表'!M52=3,\"b\",0))","v":0},{"$f":"IF('S-P表'!N52=1,1,IF('S-P表'!N52=3,\"b\",0))","v":0},{"$f":"IF('S-P表'!O52=1,1,IF('S-P表'!O52=3,\"b\",0))","v":0},{"$f":"IF('S-P表'!P52=1,1,IF('S-P表'!P52=3,\"b\",0))","v":0},{"$f":"IF('S-P表'!Q52=1,1,IF('S-P表'!Q52=3,\"b\",0))","v":0},{"$f":"IF('S-P表'!R52=1,1,IF('S-P表'!R52=3,\"b\",0))","v":0},{"$f":"IF('S-P表'!S52=1,1,IF('S-P表'!S52=3,\"b\",0))","v":0},{"$f":"IF('S-P表'!T52=1,1,IF('S-P表'!T52=3,\"b\",0))","v":0},{"$f":"IF('S-P表'!U52=1,1,IF('S-P表'!U52=3,\"b\",0))","v":0},{"$f":"IF('S-P表'!V52=1,1,IF('S-P表'!V52=3,\"b\",0))","v":0},{"$f":"IF('S-P表'!W52=1,1,IF('S-P表'!W52=3,\"b\",0))","v":0},{"$f":"IF('S-P表'!X52=1,1,IF('S-P表'!X52=3,\"b\",0))","v":0},{"$f":"IF('S-P表'!Y52=1,1,IF('S-P表'!Y52=3,\"b\",0))","v":0},{"$f":"IF('S-P表'!Z52=1,1,IF('S-P表'!Z52=3,\"b\",0))","v":0},{"$f":"IF('S-P表'!AA52=1,1,IF('S-P表'!AA52=3,\"b\",0))","v":0},{"$f":"IF('S-P表'!AB52=1,1,IF('S-P表'!AB52=3,\"b\",0))","v":0},{"$f":"IF('S-P表'!AC52=1,1,IF('S-P表'!AC52=3,\"b\",0))","v":0},{"$f":"IF('S-P表'!AD52=1,1,IF('S-P表'!AD52=3,\"b\",0))","v":0},{"$f":"IF('S-P表'!AE52=1,1,IF('S-P表'!AE52=3,\"b\",0))","v":0},{"$f":"IF('S-P表'!AF52=1,1,IF('S-P表'!AF52=3,\"b\",0))","v":0},{"$f":"IF('S-P表'!AG52=1,1,IF('S-P表'!AG52=3,\"b\",0))","v":0},{"$f":"IF('S-P表'!AH52=1,1,IF('S-P表'!AH52=3,\"b\",0))","v":0},{"$f":"IF('S-P表'!AI52=1,1,IF('S-P表'!AI52=3,\"b\",0))","v":0},{"$f":"IF('S-P表'!AJ52=1,1,IF('S-P表'!AJ52=3,\"b\",0))","v":0},{"$f":"IF('S-P表'!AK52=1,1,IF('S-P表'!AK52=3,\"b\",0))","v":0},{"$f":"IF('S-P表'!AL52=1,1,IF('S-P表'!AL52=3,\"b\",0))","v":0},{"$f":"IF('S-P表'!AM52=1,1,IF('S-P表'!AM52=3,\"b\",0))","v":0},{"$f":"IF('S-P表'!AN52=1,1,IF('S-P表'!AN52=3,\"b\",0))","v":0},{"$f":"IF('S-P表'!AO52=1,1,IF('S-P表'!AO52=3,\"b\",0))","v":0},{"$f":"IF('S-P表'!AP52=1,1,IF('S-P表'!AP52=3,\"b\",0))","v":0},{"$f":"IF('S-P表'!AQ52=1,1,IF('S-P表'!AQ52=3,\"b\",0))","v":0},{"$f":"SUM(Sheet3!D52:'Sheet3'!AQ52)","v":0}]
[null,null,null,{"$f":"IF('S-P表'!D53=1,1,IF('S-P表'!D53=3,\"b\",0))","v":0},{"$f":"IF('S-P表'!E53=1,1,IF('S-P表'!E53=3,\"b\",0))","v":0},{"$f":"IF('S-P表'!F53=1,1,IF('S-P表'!F53=3,\"b\",0))","v":0},{"$f":"IF('S-P表'!G53=1,1,IF('S-P表'!G53=3,\"b\",0))","v":0},{"$f":"IF('S-P表'!H53=1,1,IF('S-P表'!H53=3,\"b\",0))","v":0},{"$f":"IF('S-P表'!I53=1,1,IF('S-P表'!I53=3,\"b\",0))","v":0},{"$f":"IF('S-P表'!J53=1,1,IF('S-P表'!J53=3,\"b\",0))","v":0},{"$f":"IF('S-P表'!K53=1,1,IF('S-P表'!K53=3,\"b\",0))","v":0},{"$f":"IF('S-P表'!L53=1,1,IF('S-P表'!L53=3,\"b\",0))","v":0},{"$f":"IF('S-P表'!M53=1,1,IF('S-P表'!M53=3,\"b\",0))","v":0},{"$f":"IF('S-P表'!N53=1,1,IF('S-P表'!N53=3,\"b\",0))","v":0},{"$f":"IF('S-P表'!O53=1,1,IF('S-P表'!O53=3,\"b\",0))","v":0},{"$f":"IF('S-P表'!P53=1,1,IF('S-P表'!P53=3,\"b\",0))","v":0},{"$f":"IF('S-P表'!Q53=1,1,IF('S-P表'!Q53=3,\"b\",0))","v":0},{"$f":"IF('S-P表'!R53=1,1,IF('S-P表'!R53=3,\"b\",0))","v":0},{"$f":"IF('S-P表'!S53=1,1,IF('S-P表'!S53=3,\"b\",0))","v":0},{"$f":"IF('S-P表'!T53=1,1,IF('S-P表'!T53=3,\"b\",0))","v":0},{"$f":"IF('S-P表'!U53=1,1,IF('S-P表'!U53=3,\"b\",0))","v":0},{"$f":"IF('S-P表'!V53=1,1,IF('S-P表'!V53=3,\"b\",0))","v":0},{"$f":"IF('S-P表'!W53=1,1,IF('S-P表'!W53=3,\"b\",0))","v":0},{"$f":"IF('S-P表'!X53=1,1,IF('S-P表'!X53=3,\"b\",0))","v":0},{"$f":"IF('S-P表'!Y53=1,1,IF('S-P表'!Y53=3,\"b\",0))","v":0},{"$f":"IF('S-P表'!Z53=1,1,IF('S-P表'!Z53=3,\"b\",0))","v":0},{"$f":"IF('S-P表'!AA53=1,1,IF('S-P表'!AA53=3,\"b\",0))","v":0},{"$f":"IF('S-P表'!AB53=1,1,IF('S-P表'!AB53=3,\"b\",0))","v":0},{"$f":"IF('S-P表'!AC53=1,1,IF('S-P表'!AC53=3,\"b\",0))","v":0},{"$f":"IF('S-P表'!AD53=1,1,IF('S-P表'!AD53=3,\"b\",0))","v":0},{"$f":"IF('S-P表'!AE53=1,1,IF('S-P表'!AE53=3,\"b\",0))","v":0},{"$f":"IF('S-P表'!AF53=1,1,IF('S-P表'!AF53=3,\"b\",0))","v":0},{"$f":"IF('S-P表'!AG53=1,1,IF('S-P表'!AG53=3,\"b\",0))","v":0},{"$f":"IF('S-P表'!AH53=1,1,IF('S-P表'!AH53=3,\"b\",0))","v":0},{"$f":"IF('S-P表'!AI53=1,1,IF('S-P表'!AI53=3,\"b\",0))","v":0},{"$f":"IF('S-P表'!AJ53=1,1,IF('S-P表'!AJ53=3,\"b\",0))","v":0},{"$f":"IF('S-P表'!AK53=1,1,IF('S-P表'!AK53=3,\"b\",0))","v":0},{"$f":"IF('S-P表'!AL53=1,1,IF('S-P表'!AL53=3,\"b\",0))","v":0},{"$f":"IF('S-P表'!AM53=1,1,IF('S-P表'!AM53=3,\"b\",0))","v":0},{"$f":"IF('S-P表'!AN53=1,1,IF('S-P表'!AN53=3,\"b\",0))","v":0},{"$f":"IF('S-P表'!AO53=1,1,IF('S-P表'!AO53=3,\"b\",0))","v":0},{"$f":"IF('S-P表'!AP53=1,1,IF('S-P表'!AP53=3,\"b\",0))","v":0},{"$f":"IF('S-P表'!AQ53=1,1,IF('S-P表'!AQ53=3,\"b\",0))","v":0},{"$f":"SUM(Sheet3!D53:'Sheet3'!AQ53)","v":0}]
[null,null,null,{"$f":"IF('S-P表'!D54=1,1,IF('S-P表'!D54=3,\"b\",0))","v":0},{"$f":"IF('S-P表'!E54=1,1,IF('S-P表'!E54=3,\"b\",0))","v":0},{"$f":"IF('S-P表'!F54=1,1,IF('S-P表'!F54=3,\"b\",0))","v":0},{"$f":"IF('S-P表'!G54=1,1,IF('S-P表'!G54=3,\"b\",0))","v":0},{"$f":"IF('S-P表'!H54=1,1,IF('S-P表'!H54=3,\"b\",0))","v":0},{"$f":"IF('S-P表'!I54=1,1,IF('S-P表'!I54=3,\"b\",0))","v":0},{"$f":"IF('S-P表'!J54=1,1,IF('S-P表'!J54=3,\"b\",0))","v":0},{"$f":"IF('S-P表'!K54=1,1,IF('S-P表'!K54=3,\"b\",0))","v":0},{"$f":"IF('S-P表'!L54=1,1,IF('S-P表'!L54=3,\"b\",0))","v":0},{"$f":"IF('S-P表'!M54=1,1,IF('S-P表'!M54=3,\"b\",0))","v":0},{"$f":"IF('S-P表'!N54=1,1,IF('S-P表'!N54=3,\"b\",0))","v":0},{"$f":"IF('S-P表'!O54=1,1,IF('S-P表'!O54=3,\"b\",0))","v":0},{"$f":"IF('S-P表'!P54=1,1,IF('S-P表'!P54=3,\"b\",0))","v":0},{"$f":"IF('S-P表'!Q54=1,1,IF('S-P表'!Q54=3,\"b\",0))","v":0},{"$f":"IF('S-P表'!R54=1,1,IF('S-P表'!R54=3,\"b\",0))","v":0},{"$f":"IF('S-P表'!S54=1,1,IF('S-P表'!S54=3,\"b\",0))","v":0},{"$f":"IF('S-P表'!T54=1,1,IF('S-P表'!T54=3,\"b\",0))","v":0},{"$f":"IF('S-P表'!U54=1,1,IF('S-P表'!U54=3,\"b\",0))","v":0},{"$f":"IF('S-P表'!V54=1,1,IF('S-P表'!V54=3,\"b\",0))","v":0},{"$f":"IF('S-P表'!W54=1,1,IF('S-P表'!W54=3,\"b\",0))","v":0},{"$f":"IF('S-P表'!X54=1,1,IF('S-P表'!X54=3,\"b\",0))","v":0},{"$f":"IF('S-P表'!Y54=1,1,IF('S-P表'!Y54=3,\"b\",0))","v":0},{"$f":"IF('S-P表'!Z54=1,1,IF('S-P表'!Z54=3,\"b\",0))","v":0},{"$f":"IF('S-P表'!AA54=1,1,IF('S-P表'!AA54=3,\"b\",0))","v":0},{"$f":"IF('S-P表'!AB54=1,1,IF('S-P表'!AB54=3,\"b\",0))","v":0},{"$f":"IF('S-P表'!AC54=1,1,IF('S-P表'!AC54=3,\"b\",0))","v":0},{"$f":"IF('S-P表'!AD54=1,1,IF('S-P表'!AD54=3,\"b\",0))","v":0},{"$f":"IF('S-P表'!AE54=1,1,IF('S-P表'!AE54=3,\"b\",0))","v":0},{"$f":"IF('S-P表'!AF54=1,1,IF('S-P表'!AF54=3,\"b\",0))","v":0},{"$f":"IF('S-P表'!AG54=1,1,IF('S-P表'!AG54=3,\"b\",0))","v":0},{"$f":"IF('S-P表'!AH54=1,1,IF('S-P表'!AH54=3,\"b\",0))","v":0},{"$f":"IF('S-P表'!AI54=1,1,IF('S-P表'!AI54=3,\"b\",0))","v":0},{"$f":"IF('S-P表'!AJ54=1,1,IF('S-P表'!AJ54=3,\"b\",0))","v":0},{"$f":"IF('S-P表'!AK54=1,1,IF('S-P表'!AK54=3,\"b\",0))","v":0},{"$f":"IF('S-P表'!AL54=1,1,IF('S-P表'!AL54=3,\"b\",0))","v":0},{"$f":"IF('S-P表'!AM54=1,1,IF('S-P表'!AM54=3,\"b\",0))","v":0},{"$f":"IF('S-P表'!AN54=1,1,IF('S-P表'!AN54=3,\"b\",0))","v":0},{"$f":"IF('S-P表'!AO54=1,1,IF('S-P表'!AO54=3,\"b\",0))","v":0},{"$f":"IF('S-P表'!AP54=1,1,IF('S-P表'!AP54=3,\"b\",0))","v":0},{"$f":"IF('S-P表'!AQ54=1,1,IF('S-P表'!AQ54=3,\"b\",0))","v":0},{"$f":"SUM(Sheet3!D54:'Sheet3'!AQ54)","v":0}]
[null,null,null,{"$f":"IF('S-P表'!D55=1,1,IF('S-P表'!D55=3,\"b\",0))","v":0},{"$f":"IF('S-P表'!E55=1,1,IF('S-P表'!E55=3,\"b\",0))","v":0},{"$f":"IF('S-P表'!F55=1,1,IF('S-P表'!F55=3,\"b\",0))","v":0},{"$f":"IF('S-P表'!G55=1,1,IF('S-P表'!G55=3,\"b\",0))","v":0},{"$f":"IF('S-P表'!H55=1,1,IF('S-P表'!H55=3,\"b\",0))","v":0},{"$f":"IF('S-P表'!I55=1,1,IF('S-P表'!I55=3,\"b\",0))","v":0},{"$f":"IF('S-P表'!J55=1,1,IF('S-P表'!J55=3,\"b\",0))","v":0},{"$f":"IF('S-P表'!K55=1,1,IF('S-P表'!K55=3,\"b\",0))","v":0},{"$f":"IF('S-P表'!L55=1,1,IF('S-P表'!L55=3,\"b\",0))","v":0},{"$f":"IF('S-P表'!M55=1,1,IF('S-P表'!M55=3,\"b\",0))","v":0},{"$f":"IF('S-P表'!N55=1,1,IF('S-P表'!N55=3,\"b\",0))","v":0},{"$f":"IF('S-P表'!O55=1,1,IF('S-P表'!O55=3,\"b\",0))","v":0},{"$f":"IF('S-P表'!P55=1,1,IF('S-P表'!P55=3,\"b\",0))","v":0},{"$f":"IF('S-P表'!Q55=1,1,IF('S-P表'!Q55=3,\"b\",0))","v":0},{"$f":"IF('S-P表'!R55=1,1,IF('S-P表'!R55=3,\"b\",0))","v":0},{"$f":"IF('S-P表'!S55=1,1,IF('S-P表'!S55=3,\"b\",0))","v":0},{"$f":"IF('S-P表'!T55=1,1,IF('S-P表'!T55=3,\"b\",0))","v":0},{"$f":"IF('S-P表'!U55=1,1,IF('S-P表'!U55=3,\"b\",0))","v":0},{"$f":"IF('S-P表'!V55=1,1,IF('S-P表'!V55=3,\"b\",0))","v":0},{"$f":"IF('S-P表'!W55=1,1,IF('S-P表'!W55=3,\"b\",0))","v":0},{"$f":"IF('S-P表'!X55=1,1,IF('S-P表'!X55=3,\"b\",0))","v":0},{"$f":"IF('S-P表'!Y55=1,1,IF('S-P表'!Y55=3,\"b\",0))","v":0},{"$f":"IF('S-P表'!Z55=1,1,IF('S-P表'!Z55=3,\"b\",0))","v":0},{"$f":"IF('S-P表'!AA55=1,1,IF('S-P表'!AA55=3,\"b\",0))","v":0},{"$f":"IF('S-P表'!AB55=1,1,IF('S-P表'!AB55=3,\"b\",0))","v":0},{"$f":"IF('S-P表'!AC55=1,1,IF('S-P表'!AC55=3,\"b\",0))","v":0},{"$f":"IF('S-P表'!AD55=1,1,IF('S-P表'!AD55=3,\"b\",0))","v":0},{"$f":"IF('S-P表'!AE55=1,1,IF('S-P表'!AE55=3,\"b\",0))","v":0},{"$f":"IF('S-P表'!AF55=1,1,IF('S-P表'!AF55=3,\"b\",0))","v":0},{"$f":"IF('S-P表'!AG55=1,1,IF('S-P表'!AG55=3,\"b\",0))","v":0},{"$f":"IF('S-P表'!AH55=1,1,IF('S-P表'!AH55=3,\"b\",0))","v":0},{"$f":"IF('S-P表'!AI55=1,1,IF('S-P表'!AI55=3,\"b\",0))","v":0},{"$f":"IF('S-P表'!AJ55=1,1,IF('S-P表'!AJ55=3,\"b\",0))","v":0},{"$f":"IF('S-P表'!AK55=1,1,IF('S-P表'!AK55=3,\"b\",0))","v":0},{"$f":"IF('S-P表'!AL55=1,1,IF('S-P表'!AL55=3,\"b\",0))","v":0},{"$f":"IF('S-P表'!AM55=1,1,IF('S-P表'!AM55=3,\"b\",0))","v":0},{"$f":"IF('S-P表'!AN55=1,1,IF('S-P表'!AN55=3,\"b\",0))","v":0},{"$f":"IF('S-P表'!AO55=1,1,IF('S-P表'!AO55=3,\"b\",0))","v":0},{"$f":"IF('S-P表'!AP55=1,1,IF('S-P表'!AP55=3,\"b\",0))","v":0},{"$f":"IF('S-P表'!AQ55=1,1,IF('S-P表'!AQ55=3,\"b\",0))","v":0},{"$f":"SUM(Sheet3!D55:'Sheet3'!AQ55)","v":0}]
[null,null,null,{"$f":"IF('S-P表'!D56=1,1,IF('S-P表'!D56=3,\"b\",0))","v":0},{"$f":"IF('S-P表'!E56=1,1,IF('S-P表'!E56=3,\"b\",0))","v":0},{"$f":"IF('S-P表'!F56=1,1,IF('S-P表'!F56=3,\"b\",0))","v":0},{"$f":"IF('S-P表'!G56=1,1,IF('S-P表'!G56=3,\"b\",0))","v":0},{"$f":"IF('S-P表'!H56=1,1,IF('S-P表'!H56=3,\"b\",0))","v":0},{"$f":"IF('S-P表'!I56=1,1,IF('S-P表'!I56=3,\"b\",0))","v":0},{"$f":"IF('S-P表'!J56=1,1,IF('S-P表'!J56=3,\"b\",0))","v":0},{"$f":"IF('S-P表'!K56=1,1,IF('S-P表'!K56=3,\"b\",0))","v":0},{"$f":"IF('S-P表'!L56=1,1,IF('S-P表'!L56=3,\"b\",0))","v":0},{"$f":"IF('S-P表'!M56=1,1,IF('S-P表'!M56=3,\"b\",0))","v":0},{"$f":"IF('S-P表'!N56=1,1,IF('S-P表'!N56=3,\"b\",0))","v":0},{"$f":"IF('S-P表'!O56=1,1,IF('S-P表'!O56=3,\"b\",0))","v":0},{"$f":"IF('S-P表'!P56=1,1,IF('S-P表'!P56=3,\"b\",0))","v":0},{"$f":"IF('S-P表'!Q56=1,1,IF('S-P表'!Q56=3,\"b\",0))","v":0},{"$f":"IF('S-P表'!R56=1,1,IF('S-P表'!R56=3,\"b\",0))","v":0},{"$f":"IF('S-P表'!S56=1,1,IF('S-P表'!S56=3,\"b\",0))","v":0},{"$f":"IF('S-P表'!T56=1,1,IF('S-P表'!T56=3,\"b\",0))","v":0},{"$f":"IF('S-P表'!U56=1,1,IF('S-P表'!U56=3,\"b\",0))","v":0},{"$f":"IF('S-P表'!V56=1,1,IF('S-P表'!V56=3,\"b\",0))","v":0},{"$f":"IF('S-P表'!W56=1,1,IF('S-P表'!W56=3,\"b\",0))","v":0},{"$f":"IF('S-P表'!X56=1,1,IF('S-P表'!X56=3,\"b\",0))","v":0},{"$f":"IF('S-P表'!Y56=1,1,IF('S-P表'!Y56=3,\"b\",0))","v":0},{"$f":"IF('S-P表'!Z56=1,1,IF('S-P表'!Z56=3,\"b\",0))","v":0},{"$f":"IF('S-P表'!AA56=1,1,IF('S-P表'!AA56=3,\"b\",0))","v":0},{"$f":"IF('S-P表'!AB56=1,1,IF('S-P表'!AB56=3,\"b\",0))","v":0},{"$f":"IF('S-P表'!AC56=1,1,IF('S-P表'!AC56=3,\"b\",0))","v":0},{"$f":"IF('S-P表'!AD56=1,1,IF('S-P表'!AD56=3,\"b\",0))","v":0},{"$f":"IF('S-P表'!AE56=1,1,IF('S-P表'!AE56=3,\"b\",0))","v":0},{"$f":"IF('S-P表'!AF56=1,1,IF('S-P表'!AF56=3,\"b\",0))","v":0},{"$f":"IF('S-P表'!AG56=1,1,IF('S-P表'!AG56=3,\"b\",0))","v":0},{"$f":"IF('S-P表'!AH56=1,1,IF('S-P表'!AH56=3,\"b\",0))","v":0},{"$f":"IF('S-P表'!AI56=1,1,IF('S-P表'!AI56=3,\"b\",0))","v":0},{"$f":"IF('S-P表'!AJ56=1,1,IF('S-P表'!AJ56=3,\"b\",0))","v":0},{"$f":"IF('S-P表'!AK56=1,1,IF('S-P表'!AK56=3,\"b\",0))","v":0},{"$f":"IF('S-P表'!AL56=1,1,IF('S-P表'!AL56=3,\"b\",0))","v":0},{"$f":"IF('S-P表'!AM56=1,1,IF('S-P表'!AM56=3,\"b\",0))","v":0},{"$f":"IF('S-P表'!AN56=1,1,IF('S-P表'!AN56=3,\"b\",0))","v":0},{"$f":"IF('S-P表'!AO56=1,1,IF('S-P表'!AO56=3,\"b\",0))","v":0},{"$f":"IF('S-P表'!AP56=1,1,IF('S-P表'!AP56=3,\"b\",0))","v":0},{"$f":"IF('S-P表'!AQ56=1,1,IF('S-P表'!AQ56=3,\"b\",0))","v":0},{"$f":"SUM(Sheet3!D56:'Sheet3'!AQ56)","v":0}]
[null,null,null,{"$f":"IF('S-P表'!D57=1,1,IF('S-P表'!D57=3,\"b\",0))","v":0},{"$f":"IF('S-P表'!E57=1,1,IF('S-P表'!E57=3,\"b\",0))","v":0},{"$f":"IF('S-P表'!F57=1,1,IF('S-P表'!F57=3,\"b\",0))","v":0},{"$f":"IF('S-P表'!G57=1,1,IF('S-P表'!G57=3,\"b\",0))","v":0},{"$f":"IF('S-P表'!H57=1,1,IF('S-P表'!H57=3,\"b\",0))","v":0},{"$f":"IF('S-P表'!I57=1,1,IF('S-P表'!I57=3,\"b\",0))","v":0},{"$f":"IF('S-P表'!J57=1,1,IF('S-P表'!J57=3,\"b\",0))","v":0},{"$f":"IF('S-P表'!K57=1,1,IF('S-P表'!K57=3,\"b\",0))","v":0},{"$f":"IF('S-P表'!L57=1,1,IF('S-P表'!L57=3,\"b\",0))","v":0},{"$f":"IF('S-P表'!M57=1,1,IF('S-P表'!M57=3,\"b\",0))","v":0},{"$f":"IF('S-P表'!N57=1,1,IF('S-P表'!N57=3,\"b\",0))","v":0},{"$f":"IF('S-P表'!O57=1,1,IF('S-P表'!O57=3,\"b\",0))","v":0},{"$f":"IF('S-P表'!P57=1,1,IF('S-P表'!P57=3,\"b\",0))","v":0},{"$f":"IF('S-P表'!Q57=1,1,IF('S-P表'!Q57=3,\"b\",0))","v":0},{"$f":"IF('S-P表'!R57=1,1,IF('S-P表'!R57=3,\"b\",0))","v":0},{"$f":"IF('S-P表'!S57=1,1,IF('S-P表'!S57=3,\"b\",0))","v":0},{"$f":"IF('S-P表'!T57=1,1,IF('S-P表'!T57=3,\"b\",0))","v":0},{"$f":"IF('S-P表'!U57=1,1,IF('S-P表'!U57=3,\"b\",0))","v":0},{"$f":"IF('S-P表'!V57=1,1,IF('S-P表'!V57=3,\"b\",0))","v":0},{"$f":"IF('S-P表'!W57=1,1,IF('S-P表'!W57=3,\"b\",0))","v":0},{"$f":"IF('S-P表'!X57=1,1,IF('S-P表'!X57=3,\"b\",0))","v":0},{"$f":"IF('S-P表'!Y57=1,1,IF('S-P表'!Y57=3,\"b\",0))","v":0},{"$f":"IF('S-P表'!Z57=1,1,IF('S-P表'!Z57=3,\"b\",0))","v":0},{"$f":"IF('S-P表'!AA57=1,1,IF('S-P表'!AA57=3,\"b\",0))","v":0},{"$f":"IF('S-P表'!AB57=1,1,IF('S-P表'!AB57=3,\"b\",0))","v":0},{"$f":"IF('S-P表'!AC57=1,1,IF('S-P表'!AC57=3,\"b\",0))","v":0},{"$f":"IF('S-P表'!AD57=1,1,IF('S-P表'!AD57=3,\"b\",0))","v":0},{"$f":"IF('S-P表'!AE57=1,1,IF('S-P表'!AE57=3,\"b\",0))","v":0},{"$f":"IF('S-P表'!AF57=1,1,IF('S-P表'!AF57=3,\"b\",0))","v":0},{"$f":"IF('S-P表'!AG57=1,1,IF('S-P表'!AG57=3,\"b\",0))","v":0},{"$f":"IF('S-P表'!AH57=1,1,IF('S-P表'!AH57=3,\"b\",0))","v":0},{"$f":"IF('S-P表'!AI57=1,1,IF('S-P表'!AI57=3,\"b\",0))","v":0},{"$f":"IF('S-P表'!AJ57=1,1,IF('S-P表'!AJ57=3,\"b\",0))","v":0},{"$f":"IF('S-P表'!AK57=1,1,IF('S-P表'!AK57=3,\"b\",0))","v":0},{"$f":"IF('S-P表'!AL57=1,1,IF('S-P表'!AL57=3,\"b\",0))","v":0},{"$f":"IF('S-P表'!AM57=1,1,IF('S-P表'!AM57=3,\"b\",0))","v":0},{"$f":"IF('S-P表'!AN57=1,1,IF('S-P表'!AN57=3,\"b\",0))","v":0},{"$f":"IF('S-P表'!AO57=1,1,IF('S-P表'!AO57=3,\"b\",0))","v":0},{"$f":"IF('S-P表'!AP57=1,1,IF('S-P表'!AP57=3,\"b\",0))","v":0},{"$f":"IF('S-P表'!AQ57=1,1,IF('S-P表'!AQ57=3,\"b\",0))","v":0},{"$f":"SUM(Sheet3!D57:'Sheet3'!AQ57)","v":0}]
[null,null,null,{"$f":"IF('S-P表'!D58=1,1,IF('S-P表'!D58=3,\"b\",0))","v":0},{"$f":"IF('S-P表'!E58=1,1,IF('S-P表'!E58=3,\"b\",0))","v":0},{"$f":"IF('S-P表'!F58=1,1,IF('S-P表'!F58=3,\"b\",0))","v":0},{"$f":"IF('S-P表'!G58=1,1,IF('S-P表'!G58=3,\"b\",0))","v":0},{"$f":"IF('S-P表'!H58=1,1,IF('S-P表'!H58=3,\"b\",0))","v":0},{"$f":"IF('S-P表'!I58=1,1,IF('S-P表'!I58=3,\"b\",0))","v":0},{"$f":"IF('S-P表'!J58=1,1,IF('S-P表'!J58=3,\"b\",0))","v":0},{"$f":"IF('S-P表'!K58=1,1,IF('S-P表'!K58=3,\"b\",0))","v":0},{"$f":"IF('S-P表'!L58=1,1,IF('S-P表'!L58=3,\"b\",0))","v":0},{"$f":"IF('S-P表'!M58=1,1,IF('S-P表'!M58=3,\"b\",0))","v":0},{"$f":"IF('S-P表'!N58=1,1,IF('S-P表'!N58=3,\"b\",0))","v":0},{"$f":"IF('S-P表'!O58=1,1,IF('S-P表'!O58=3,\"b\",0))","v":0},{"$f":"IF('S-P表'!P58=1,1,IF('S-P表'!P58=3,\"b\",0))","v":0},{"$f":"IF('S-P表'!Q58=1,1,IF('S-P表'!Q58=3,\"b\",0))","v":0},{"$f":"IF('S-P表'!R58=1,1,IF('S-P表'!R58=3,\"b\",0))","v":0},{"$f":"IF('S-P表'!S58=1,1,IF('S-P表'!S58=3,\"b\",0))","v":0},{"$f":"IF('S-P表'!T58=1,1,IF('S-P表'!T58=3,\"b\",0))","v":0},{"$f":"IF('S-P表'!U58=1,1,IF('S-P表'!U58=3,\"b\",0))","v":0},{"$f":"IF('S-P表'!V58=1,1,IF('S-P表'!V58=3,\"b\",0))","v":0},{"$f":"IF('S-P表'!W58=1,1,IF('S-P表'!W58=3,\"b\",0))","v":0},{"$f":"IF('S-P表'!X58=1,1,IF('S-P表'!X58=3,\"b\",0))","v":0},{"$f":"IF('S-P表'!Y58=1,1,IF('S-P表'!Y58=3,\"b\",0))","v":0},{"$f":"IF('S-P表'!Z58=1,1,IF('S-P表'!Z58=3,\"b\",0))","v":0},{"$f":"IF('S-P表'!AA58=1,1,IF('S-P表'!AA58=3,\"b\",0))","v":0},{"$f":"IF('S-P表'!AB58=1,1,IF('S-P表'!AB58=3,\"b\",0))","v":0},{"$f":"IF('S-P表'!AC58=1,1,IF('S-P表'!AC58=3,\"b\",0))","v":0},{"$f":"IF('S-P表'!AD58=1,1,IF('S-P表'!AD58=3,\"b\",0))","v":0},{"$f":"IF('S-P表'!AE58=1,1,IF('S-P表'!AE58=3,\"b\",0))","v":0},{"$f":"IF('S-P表'!AF58=1,1,IF('S-P表'!AF58=3,\"b\",0))","v":0},{"$f":"IF('S-P表'!AG58=1,1,IF('S-P表'!AG58=3,\"b\",0))","v":0},{"$f":"IF('S-P表'!AH58=1,1,IF('S-P表'!AH58=3,\"b\",0))","v":0},{"$f":"IF('S-P表'!AI58=1,1,IF('S-P表'!AI58=3,\"b\",0))","v":0},{"$f":"IF('S-P表'!AJ58=1,1,IF('S-P表'!AJ58=3,\"b\",0))","v":0},{"$f":"IF('S-P表'!AK58=1,1,IF('S-P表'!AK58=3,\"b\",0))","v":0},{"$f":"IF('S-P表'!AL58=1,1,IF('S-P表'!AL58=3,\"b\",0))","v":0},{"$f":"IF('S-P表'!AM58=1,1,IF('S-P表'!AM58=3,\"b\",0))","v":0},{"$f":"IF('S-P表'!AN58=1,1,IF('S-P表'!AN58=3,\"b\",0))","v":0},{"$f":"IF('S-P表'!AO58=1,1,IF('S-P表'!AO58=3,\"b\",0))","v":0},{"$f":"IF('S-P表'!AP58=1,1,IF('S-P表'!AP58=3,\"b\",0))","v":0},{"$f":"IF('S-P表'!AQ58=1,1,IF('S-P表'!AQ58=3,\"b\",0))","v":0},{"$f":"SUM(Sheet3!D58:'Sheet3'!AQ58)","v":0}]
[null,null,null,{"$f":"IF('S-P表'!D59=1,1,IF('S-P表'!D59=3,\"b\",0))","v":0},{"$f":"IF('S-P表'!E59=1,1,IF('S-P表'!E59=3,\"b\",0))","v":0},{"$f":"IF('S-P表'!F59=1,1,IF('S-P表'!F59=3,\"b\",0))","v":0},{"$f":"IF('S-P表'!G59=1,1,IF('S-P表'!G59=3,\"b\",0))","v":0},{"$f":"IF('S-P表'!H59=1,1,IF('S-P表'!H59=3,\"b\",0))","v":0},{"$f":"IF('S-P表'!I59=1,1,IF('S-P表'!I59=3,\"b\",0))","v":0},{"$f":"IF('S-P表'!J59=1,1,IF('S-P表'!J59=3,\"b\",0))","v":0},{"$f":"IF('S-P表'!K59=1,1,IF('S-P表'!K59=3,\"b\",0))","v":0},{"$f":"IF('S-P表'!L59=1,1,IF('S-P表'!L59=3,\"b\",0))","v":0},{"$f":"IF('S-P表'!M59=1,1,IF('S-P表'!M59=3,\"b\",0))","v":0},{"$f":"IF('S-P表'!N59=1,1,IF('S-P表'!N59=3,\"b\",0))","v":0},{"$f":"IF('S-P表'!O59=1,1,IF('S-P表'!O59=3,\"b\",0))","v":0},{"$f":"IF('S-P表'!P59=1,1,IF('S-P表'!P59=3,\"b\",0))","v":0},{"$f":"IF('S-P表'!Q59=1,1,IF('S-P表'!Q59=3,\"b\",0))","v":0},{"$f":"IF('S-P表'!R59=1,1,IF('S-P表'!R59=3,\"b\",0))","v":0},{"$f":"IF('S-P表'!S59=1,1,IF('S-P表'!S59=3,\"b\",0))","v":0},{"$f":"IF('S-P表'!T59=1,1,IF('S-P表'!T59=3,\"b\",0))","v":0},{"$f":"IF('S-P表'!U59=1,1,IF('S-P表'!U59=3,\"b\",0))","v":0},{"$f":"IF('S-P表'!V59=1,1,IF('S-P表'!V59=3,\"b\",0))","v":0},{"$f":"IF('S-P表'!W59=1,1,IF('S-P表'!W59=3,\"b\",0))","v":0},{"$f":"IF('S-P表'!X59=1,1,IF('S-P表'!X59=3,\"b\",0))","v":0},{"$f":"IF('S-P表'!Y59=1,1,IF('S-P表'!Y59=3,\"b\",0))","v":0},{"$f":"IF('S-P表'!Z59=1,1,IF('S-P表'!Z59=3,\"b\",0))","v":0},{"$f":"IF('S-P表'!AA59=1,1,IF('S-P表'!AA59=3,\"b\",0))","v":0},{"$f":"IF('S-P表'!AB59=1,1,IF('S-P表'!AB59=3,\"b\",0))","v":0},{"$f":"IF('S-P表'!AC59=1,1,IF('S-P表'!AC59=3,\"b\",0))","v":0},{"$f":"IF('S-P表'!AD59=1,1,IF('S-P表'!AD59=3,\"b\",0))","v":0},{"$f":"IF('S-P表'!AE59=1,1,IF('S-P表'!AE59=3,\"b\",0))","v":0},{"$f":"IF('S-P表'!AF59=1,1,IF('S-P表'!AF59=3,\"b\",0))","v":0},{"$f":"IF('S-P表'!AG59=1,1,IF('S-P表'!AG59=3,\"b\",0))","v":0},{"$f":"IF('S-P表'!AH59=1,1,IF('S-P表'!AH59=3,\"b\",0))","v":0},{"$f":"IF('S-P表'!AI59=1,1,IF('S-P表'!AI59=3,\"b\",0))","v":0},{"$f":"IF('S-P表'!AJ59=1,1,IF('S-P表'!AJ59=3,\"b\",0))","v":0},{"$f":"IF('S-P表'!AK59=1,1,IF('S-P表'!AK59=3,\"b\",0))","v":0},{"$f":"IF('S-P表'!AL59=1,1,IF('S-P表'!AL59=3,\"b\",0))","v":0},{"$f":"IF('S-P表'!AM59=1,1,IF('S-P表'!AM59=3,\"b\",0))","v":0},{"$f":"IF('S-P表'!AN59=1,1,IF('S-P表'!AN59=3,\"b\",0))","v":0},{"$f":"IF('S-P表'!AO59=1,1,IF('S-P表'!AO59=3,\"b\",0))","v":0},{"$f":"IF('S-P表'!AP59=1,1,IF('S-P表'!AP59=3,\"b\",0))","v":0},{"$f":"IF('S-P表'!AQ59=1,1,IF('S-P表'!AQ59=3,\"b\",0))","v":0},{"$f":"SUM(Sheet3!D59:'Sheet3'!AQ59)","v":0}]
[null,null,null,{"$f":"IF('S-P表'!D60=1,1,IF('S-P表'!D60=3,\"b\",0))","v":0},{"$f":"IF('S-P表'!E60=1,1,IF('S-P表'!E60=3,\"b\",0))","v":0},{"$f":"IF('S-P表'!F60=1,1,IF('S-P表'!F60=3,\"b\",0))","v":0},{"$f":"IF('S-P表'!G60=1,1,IF('S-P表'!G60=3,\"b\",0))","v":0},{"$f":"IF('S-P表'!H60=1,1,IF('S-P表'!H60=3,\"b\",0))","v":0},{"$f":"IF('S-P表'!I60=1,1,IF('S-P表'!I60=3,\"b\",0))","v":0},{"$f":"IF('S-P表'!J60=1,1,IF('S-P表'!J60=3,\"b\",0))","v":0},{"$f":"IF('S-P表'!K60=1,1,IF('S-P表'!K60=3,\"b\",0))","v":0},{"$f":"IF('S-P表'!L60=1,1,IF('S-P表'!L60=3,\"b\",0))","v":0},{"$f":"IF('S-P表'!M60=1,1,IF('S-P表'!M60=3,\"b\",0))","v":0},{"$f":"IF('S-P表'!N60=1,1,IF('S-P表'!N60=3,\"b\",0))","v":0},{"$f":"IF('S-P表'!O60=1,1,IF('S-P表'!O60=3,\"b\",0))","v":0},{"$f":"IF('S-P表'!P60=1,1,IF('S-P表'!P60=3,\"b\",0))","v":0},{"$f":"IF('S-P表'!Q60=1,1,IF('S-P表'!Q60=3,\"b\",0))","v":0},{"$f":"IF('S-P表'!R60=1,1,IF('S-P表'!R60=3,\"b\",0))","v":0},{"$f":"IF('S-P表'!S60=1,1,IF('S-P表'!S60=3,\"b\",0))","v":0},{"$f":"IF('S-P表'!T60=1,1,IF('S-P表'!T60=3,\"b\",0))","v":0},{"$f":"IF('S-P表'!U60=1,1,IF('S-P表'!U60=3,\"b\",0))","v":0},{"$f":"IF('S-P表'!V60=1,1,IF('S-P表'!V60=3,\"b\",0))","v":0},{"$f":"IF('S-P表'!W60=1,1,IF('S-P表'!W60=3,\"b\",0))","v":0},{"$f":"IF('S-P表'!X60=1,1,IF('S-P表'!X60=3,\"b\",0))","v":0},{"$f":"IF('S-P表'!Y60=1,1,IF('S-P表'!Y60=3,\"b\",0))","v":0},{"$f":"IF('S-P表'!Z60=1,1,IF('S-P表'!Z60=3,\"b\",0))","v":0},{"$f":"IF('S-P表'!AA60=1,1,IF('S-P表'!AA60=3,\"b\",0))","v":0},{"$f":"IF('S-P表'!AB60=1,1,IF('S-P表'!AB60=3,\"b\",0))","v":0},{"$f":"IF('S-P表'!AC60=1,1,IF('S-P表'!AC60=3,\"b\",0))","v":0},{"$f":"IF('S-P表'!AD60=1,1,IF('S-P表'!AD60=3,\"b\",0))","v":0},{"$f":"IF('S-P表'!AE60=1,1,IF('S-P表'!AE60=3,\"b\",0))","v":0},{"$f":"IF('S-P表'!AF60=1,1,IF('S-P表'!AF60=3,\"b\",0))","v":0},{"$f":"IF('S-P表'!AG60=1,1,IF('S-P表'!AG60=3,\"b\",0))","v":0},{"$f":"IF('S-P表'!AH60=1,1,IF('S-P表'!AH60=3,\"b\",0))","v":0},{"$f":"IF('S-P表'!AI60=1,1,IF('S-P表'!AI60=3,\"b\",0))","v":0},{"$f":"IF('S-P表'!AJ60=1,1,IF('S-P表'!AJ60=3,\"b\",0))","v":0},{"$f":"IF('S-P表'!AK60=1,1,IF('S-P表'!AK60=3,\"b\",0))","v":0},{"$f":"IF('S-P表'!AL60=1,1,IF('S-P表'!AL60=3,\"b\",0))","v":0},{"$f":"IF('S-P表'!AM60=1,1,IF('S-P表'!AM60=3,\"b\",0))","v":0},{"$f":"IF('S-P表'!AN60=1,1,IF('S-P表'!AN60=3,\"b\",0))","v":0},{"$f":"IF('S-P表'!AO60=1,1,IF('S-P表'!AO60=3,\"b\",0))","v":0},{"$f":"IF('S-P表'!AP60=1,1,IF('S-P表'!AP60=3,\"b\",0))","v":0},{"$f":"IF('S-P表'!AQ60=1,1,IF('S-P表'!AQ60=3,\"b\",0))","v":0},{"$f":"SUM(Sheet3!D60:'Sheet3'!AQ60)","v":0}]
[null,null,null,{"$f":"IF('S-P表'!D61=1,1,IF('S-P表'!D61=3,\"b\",0))","v":0},{"$f":"IF('S-P表'!E61=1,1,IF('S-P表'!E61=3,\"b\",0))","v":0},{"$f":"IF('S-P表'!F61=1,1,IF('S-P表'!F61=3,\"b\",0))","v":0},{"$f":"IF('S-P表'!G61=1,1,IF('S-P表'!G61=3,\"b\",0))","v":0},{"$f":"IF('S-P表'!H61=1,1,IF('S-P表'!H61=3,\"b\",0))","v":0},{"$f":"IF('S-P表'!I61=1,1,IF('S-P表'!I61=3,\"b\",0))","v":0},{"$f":"IF('S-P表'!J61=1,1,IF('S-P表'!J61=3,\"b\",0))","v":0},{"$f":"IF('S-P表'!K61=1,1,IF('S-P表'!K61=3,\"b\",0))","v":0},{"$f":"IF('S-P表'!L61=1,1,IF('S-P表'!L61=3,\"b\",0))","v":0},{"$f":"IF('S-P表'!M61=1,1,IF('S-P表'!M61=3,\"b\",0))","v":0},{"$f":"IF('S-P表'!N61=1,1,IF('S-P表'!N61=3,\"b\",0))","v":0},{"$f":"IF('S-P表'!O61=1,1,IF('S-P表'!O61=3,\"b\",0))","v":0},{"$f":"IF('S-P表'!P61=1,1,IF('S-P表'!P61=3,\"b\",0))","v":0},{"$f":"IF('S-P表'!Q61=1,1,IF('S-P表'!Q61=3,\"b\",0))","v":0},{"$f":"IF('S-P表'!R61=1,1,IF('S-P表'!R61=3,\"b\",0))","v":0},{"$f":"IF('S-P表'!S61=1,1,IF('S-P表'!S61=3,\"b\",0))","v":0},{"$f":"IF('S-P表'!T61=1,1,IF('S-P表'!T61=3,\"b\",0))","v":0},{"$f":"IF('S-P表'!U61=1,1,IF('S-P表'!U61=3,\"b\",0))","v":0},{"$f":"IF('S-P表'!V61=1,1,IF('S-P表'!V61=3,\"b\",0))","v":0},{"$f":"IF('S-P表'!W61=1,1,IF('S-P表'!W61=3,\"b\",0))","v":0},{"$f":"IF('S-P表'!X61=1,1,IF('S-P表'!X61=3,\"b\",0))","v":0},{"$f":"IF('S-P表'!Y61=1,1,IF('S-P表'!Y61=3,\"b\",0))","v":0},{"$f":"IF('S-P表'!Z61=1,1,IF('S-P表'!Z61=3,\"b\",0))","v":0},{"$f":"IF('S-P表'!AA61=1,1,IF('S-P表'!AA61=3,\"b\",0))","v":0},{"$f":"IF('S-P表'!AB61=1,1,IF('S-P表'!AB61=3,\"b\",0))","v":0},{"$f":"IF('S-P表'!AC61=1,1,IF('S-P表'!AC61=3,\"b\",0))","v":0},{"$f":"IF('S-P表'!AD61=1,1,IF('S-P表'!AD61=3,\"b\",0))","v":0},{"$f":"IF('S-P表'!AE61=1,1,IF('S-P表'!AE61=3,\"b\",0))","v":0},{"$f":"IF('S-P表'!AF61=1,1,IF('S-P表'!AF61=3,\"b\",0))","v":0},{"$f":"IF('S-P表'!AG61=1,1,IF('S-P表'!AG61=3,\"b\",0))","v":0},{"$f":"IF('S-P表'!AH61=1,1,IF('S-P表'!AH61=3,\"b\",0))","v":0},{"$f":"IF('S-P表'!AI61=1,1,IF('S-P表'!AI61=3,\"b\",0))","v":0},{"$f":"IF('S-P表'!AJ61=1,1,IF('S-P表'!AJ61=3,\"b\",0))","v":0},{"$f":"IF('S-P表'!AK61=1,1,IF('S-P表'!AK61=3,\"b\",0))","v":0},{"$f":"IF('S-P表'!AL61=1,1,IF('S-P表'!AL61=3,\"b\",0))","v":0},{"$f":"IF('S-P表'!AM61=1,1,IF('S-P表'!AM61=3,\"b\",0))","v":0},{"$f":"IF('S-P表'!AN61=1,1,IF('S-P表'!AN61=3,\"b\",0))","v":0},{"$f":"IF('S-P表'!AO61=1,1,IF('S-P表'!AO61=3,\"b\",0))","v":0},{"$f":"IF('S-P表'!AP61=1,1,IF('S-P表'!AP61=3,\"b\",0))","v":0},{"$f":"IF('S-P表'!AQ61=1,1,IF('S-P表'!AQ61=3,\"b\",0))","v":0},{"$f":"SUM(Sheet3!D61:'Sheet3'!AQ61)","v":0}]
[null,null,null,{"$f":"IF('S-P表'!D62=1,1,IF('S-P表'!D62=3,\"b\",0))","v":0},{"$f":"IF('S-P表'!E62=1,1,IF('S-P表'!E62=3,\"b\",0))","v":0},{"$f":"IF('S-P表'!F62=1,1,IF('S-P表'!F62=3,\"b\",0))","v":0},{"$f":"IF('S-P表'!G62=1,1,IF('S-P表'!G62=3,\"b\",0))","v":0},{"$f":"IF('S-P表'!H62=1,1,IF('S-P表'!H62=3,\"b\",0))","v":0},{"$f":"IF('S-P表'!I62=1,1,IF('S-P表'!I62=3,\"b\",0))","v":0},{"$f":"IF('S-P表'!J62=1,1,IF('S-P表'!J62=3,\"b\",0))","v":0},{"$f":"IF('S-P表'!K62=1,1,IF('S-P表'!K62=3,\"b\",0))","v":0},{"$f":"IF('S-P表'!L62=1,1,IF('S-P表'!L62=3,\"b\",0))","v":0},{"$f":"IF('S-P表'!M62=1,1,IF('S-P表'!M62=3,\"b\",0))","v":0},{"$f":"IF('S-P表'!N62=1,1,IF('S-P表'!N62=3,\"b\",0))","v":0},{"$f":"IF('S-P表'!O62=1,1,IF('S-P表'!O62=3,\"b\",0))","v":0},{"$f":"IF('S-P表'!P62=1,1,IF('S-P表'!P62=3,\"b\",0))","v":0},{"$f":"IF('S-P表'!Q62=1,1,IF('S-P表'!Q62=3,\"b\",0))","v":0},{"$f":"IF('S-P表'!R62=1,1,IF('S-P表'!R62=3,\"b\",0))","v":0},{"$f":"IF('S-P表'!S62=1,1,IF('S-P表'!S62=3,\"b\",0))","v":0},{"$f":"IF('S-P表'!T62=1,1,IF('S-P表'!T62=3,\"b\",0))","v":0},{"$f":"IF('S-P表'!U62=1,1,IF('S-P表'!U62=3,\"b\",0))","v":0},{"$f":"IF('S-P表'!V62=1,1,IF('S-P表'!V62=3,\"b\",0))","v":0},{"$f":"IF('S-P表'!W62=1,1,IF('S-P表'!W62=3,\"b\",0))","v":0},{"$f":"IF('S-P表'!X62=1,1,IF('S-P表'!X62=3,\"b\",0))","v":0},{"$f":"IF('S-P表'!Y62=1,1,IF('S-P表'!Y62=3,\"b\",0))","v":0},{"$f":"IF('S-P表'!Z62=1,1,IF('S-P表'!Z62=3,\"b\",0))","v":0},{"$f":"IF('S-P表'!AA62=1,1,IF('S-P表'!AA62=3,\"b\",0))","v":0},{"$f":"IF('S-P表'!AB62=1,1,IF('S-P表'!AB62=3,\"b\",0))","v":0},{"$f":"IF('S-P表'!AC62=1,1,IF('S-P表'!AC62=3,\"b\",0))","v":0},{"$f":"IF('S-P表'!AD62=1,1,IF('S-P表'!AD62=3,\"b\",0))","v":0},{"$f":"IF('S-P表'!AE62=1,1,IF('S-P表'!AE62=3,\"b\",0))","v":0},{"$f":"IF('S-P表'!AF62=1,1,IF('S-P表'!AF62=3,\"b\",0))","v":0},{"$f":"IF('S-P表'!AG62=1,1,IF('S-P表'!AG62=3,\"b\",0))","v":0},{"$f":"IF('S-P表'!AH62=1,1,IF('S-P表'!AH62=3,\"b\",0))","v":0},{"$f":"IF('S-P表'!AI62=1,1,IF('S-P表'!AI62=3,\"b\",0))","v":0},{"$f":"IF('S-P表'!AJ62=1,1,IF('S-P表'!AJ62=3,\"b\",0))","v":0},{"$f":"IF('S-P表'!AK62=1,1,IF('S-P表'!AK62=3,\"b\",0))","v":0},{"$f":"IF('S-P表'!AL62=1,1,IF('S-P表'!AL62=3,\"b\",0))","v":0},{"$f":"IF('S-P表'!AM62=1,1,IF('S-P表'!AM62=3,\"b\",0))","v":0},{"$f":"IF('S-P表'!AN62=1,1,IF('S-P表'!AN62=3,\"b\",0))","v":0},{"$f":"IF('S-P表'!AO62=1,1,IF('S-P表'!AO62=3,\"b\",0))","v":0},{"$f":"IF('S-P表'!AP62=1,1,IF('S-P表'!AP62=3,\"b\",0))","v":0},{"$f":"IF('S-P表'!AQ62=1,1,IF('S-P表'!AQ62=3,\"b\",0))","v":0},{"$f":"SUM(Sheet3!D62:'Sheet3'!AQ62)","v":0}]
[null,null,null,{"$f":"SUM(Sheet3!D3:'Sheet3'!D62)","v":0},{"$f":"SUM(Sheet3!E3:'Sheet3'!E62)","v":0},{"$f":"SUM(Sheet3!F3:'Sheet3'!F62)","v":0},{"$f":"SUM(Sheet3!G3:'Sheet3'!G62)","v":0},{"$f":"SUM(Sheet3!H3:'Sheet3'!H62)","v":0},{"$f":"SUM(Sheet3!I3:'Sheet3'!I62)","v":0},{"$f":"SUM(Sheet3!J3:'Sheet3'!J62)","v":0},{"$f":"SUM(Sheet3!K3:'Sheet3'!K62)","v":0},{"$f":"SUM(Sheet3!L3:'Sheet3'!L62)","v":0},{"$f":"SUM(Sheet3!M3:'Sheet3'!M62)","v":0},{"$f":"SUM(Sheet3!N3:'Sheet3'!N62)","v":0},{"$f":"SUM(Sheet3!O3:'Sheet3'!O62)","v":0},{"$f":"SUM(Sheet3!P3:'Sheet3'!P62)","v":0},{"$f":"SUM(Sheet3!Q3:'Sheet3'!Q62)","v":0},{"$f":"SUM(Sheet3!R3:'Sheet3'!R62)","v":0},{"$f":"SUM(Sheet3!S3:'Sheet3'!S62)","v":0},{"$f":"SUM(Sheet3!T3:'Sheet3'!T62)","v":0},{"$f":"SUM(Sheet3!U3:'Sheet3'!U62)","v":0},{"$f":"SUM(Sheet3!V3:'Sheet3'!V62)","v":0},{"$f":"SUM(Sheet3!W3:'Sheet3'!W62)","v":0},{"$f":"SUM(Sheet3!X3:'Sheet3'!X62)","v":0},{"$f":"SUM(Sheet3!Y3:'Sheet3'!Y62)","v":0},{"$f":"SUM(Sheet3!Z3:'Sheet3'!Z62)","v":0},{"$f":"SUM(Sheet3!AA3:'Sheet3'!AA62)","v":0},{"$f":"SUM(Sheet3!AB3:'Sheet3'!AB62)","v":0},{"$f":"SUM(Sheet3!AC3:'Sheet3'!AC62)","v":0},{"$f":"SUM(Sheet3!AD3:'Sheet3'!AD62)","v":0},{"$f":"SUM(Sheet3!AE3:'Sheet3'!AE62)","v":0},{"$f":"SUM(Sheet3!AF3:'Sheet3'!AF62)","v":0},{"$f":"SUM(Sheet3!AG3:'Sheet3'!AG62)","v":0},{"$f":"SUM(Sheet3!AH3:'Sheet3'!AH62)","v":0},{"$f":"SUM(Sheet3!AI3:'Sheet3'!AI62)","v":0},{"$f":"SUM(Sheet3!AJ3:'Sheet3'!AJ62)","v":0},{"$f":"SUM(Sheet3!AK3:'Sheet3'!AK62)","v":0},{"$f":"SUM(Sheet3!AL3:'Sheet3'!AL62)","v":0},{"$f":"SUM(Sheet3!AM3:'Sheet3'!AM62)","v":0},{"$f":"SUM(Sheet3!AN3:'Sheet3'!AN62)","v":0},{"$f":"SUM(Sheet3!AO3:'Sheet3'!AO62)","v":0},{"$f":"SUM(Sheet3!AP3:'Sheet3'!AP62)","v":0},{"$f":"SUM(Sheet3!AQ3:'Sheet3'!AQ62)","v":0},{"$f":"SUM(Sheet3!AR3:'Sheet3'!AR62)","v":0}]